{"text_format":"1","workbook":"xlsx","n_sheets":29,"sheets":["P9_Resultater","D9_Resultater","P10_Resultater","D10_Resultater","P11_Resultater","D11_Resultater","P12_Resultater","D12_Resultater","P13_Resultater","D13_Resultater","P14_Resultater","D14_Resultater","P15_Resultater","D15_Resultater","P16_Resultater","D16_Resultater","P17_Resultater","D17_Resultater","P18_Resultater","D18_Resultater","P19_Resultater","D19_Resultater","Pointformler","Print9_15","Print16_19","Print16_19a","Print9_15 Diplom","Print16_19 Diplom","Info"],"not_rendered":{"charts":0,"images":7,"macros":1,"external_links":1,"defined_names":26,"comments":0,"pivot_tables":0},"unopened":[],"bounds":{"document_bytes":16777216,"sheet_cells":100000,"rows_first":2000,"rows_last":500,"rows_between":2000,"halvings":0,"cell_chars":16384,"cell_head_chars":4096},"cells_cut":0,"cells_raw":0,"read":"whole","date_system":"1900"}

{"sheet":"P9_Resultater","index":0,"n_rows":18,"n_cols":13,"rows_kept":18,"cut":false,"hidden":false,"merged":[[2,4,2,6],[7,10,7,11],[8,10,8,11],[10,10,11,10]]}
[]
[]
[null,null,null,"Køn","Alder"]
[null,null,null,"P",9,null,"år",null,{"$f":"CONCATENATE(\"DAF_\",D4,E4)","v":"DAF_P9"}]
[null,null,null,null,"Res.",null,"Point"]
[null,null,null,"40m",null,null,{"$f":"IF(OR(ISBLANK(E6),E6>VLOOKUP($D6,INDIRECT($I$4),6,FALSE)),0,INT(VLOOKUP($D6,INDIRECT($I$4),2,FALSE)+VLOOKUP($D6,INDIRECT($I$4),3,FALSE)*I6+VLOOKUP($D6,INDIRECT($I$4),4,FALSE)*I6*I6))","v":0},null,{"$f":"IF(F6=\"[Man]\",ROUND(E6,1)+VLOOKUP($D6,INDIRECT($I$4),5,FALSE)/100,E6)","v":0},null,null,null,{"$f":"VLOOKUP($D6,INDIRECT($I$4),7,FALSE)","v":6.3}]
[null,null,null,"400m",null,null,{"$f":"IF(OR(ISBLANK(E7),E7>VLOOKUP($D7,INDIRECT($I$4),6,FALSE)),0,INT(VLOOKUP($D7,INDIRECT($I$4),2,FALSE)+VLOOKUP($D7,INDIRECT($I$4),3,FALSE)*I7+VLOOKUP($D7,INDIRECT($I$4),4,FALSE)*I7*I7))","v":0},null,{"$f":"IF(F7=\"[Man]\",ROUND(E7,1)+VLOOKUP($D7,INDIRECT($I$4),5,FALSE)/100,E7)","v":0},null,null,null,{"$f":"VLOOKUP($D7,INDIRECT($I$4),7,FALSE)","v":72.5}]
[null,null,null,"800m",null,null,{"$f":"IF(OR(ISBLANK(E8), E8>VLOOKUP($D8,INDIRECT($I$4),6,FALSE)),0,INT(VLOOKUP($D8,INDIRECT($I$4),2,FALSE)+VLOOKUP($D8,INDIRECT($I$4),3,FALSE)*E8*86400+VLOOKUP($D8,INDIRECT($I$4),4,FALSE)*E8*86400*E8*86400))","v":0},null,null,"Navn:",null,null,"00:02:32.610"]
[null,null,null,"4x40m",null,null,{"$f":"IF(OR(ISBLANK(E9),E9>VLOOKUP($D9,INDIRECT($I$4),6,FALSE)),0,INT(VLOOKUP($D9,INDIRECT($I$4),2,FALSE)+VLOOKUP($D9,INDIRECT($I$4),3,FALSE)*I9+VLOOKUP($D9,INDIRECT($I$4),4,FALSE)*I9*I9))","v":0},null,{"$f":"IF(F9=\"[Man]\",ROUND(E9,1)+VLOOKUP($D9,INDIRECT($I$4),5,FALSE)/100,E9)","v":0},"Klub:",{"$f":"IF(Info!D29=0,\" \",Info!D29)","v":"Vejle IF"},null,24.91]
[null,null,null,"højde",null,null,{"$f":"IF(OR(ISBLANK(E10), E10<VLOOKUP($D10,INDIRECT($I$4),6,FALSE)),0,INT(VLOOKUP($D10,INDIRECT($I$4),2,FALSE)+VLOOKUP($D10,INDIRECT($I$4),3,FALSE)*E10+VLOOKUP($D10,INDIRECT($I$4),4,FALSE)*E10*E10))","v":0},null,null,"(klub indtastes i Info skemaet)",null,null,1.25]
[null,null,null,"længde",null,null,{"$f":"IF(OR(ISBLANK(E11), E11<VLOOKUP($D11,INDIRECT($I$4),6,FALSE)),0,INT(VLOOKUP($D11,INDIRECT($I$4),2,FALSE)+VLOOKUP($D11,INDIRECT($I$4),3,FALSE)*E11+VLOOKUP($D11,INDIRECT($I$4),4,FALSE)*E11*E11))","v":0},null,null,null,{"$f":"Info!G28","v":"På   diplom"},null,4.01]
[null,null,null,"kugle",null,null,{"$f":"IF(OR(ISBLANK(E12), E12<VLOOKUP($D12,INDIRECT($I$4),6,FALSE)),0,INT(VLOOKUP($D12,INDIRECT($I$4),2,FALSE)+VLOOKUP($D12,INDIRECT($I$4),3,FALSE)*E12+VLOOKUP($D12,INDIRECT($I$4),4,FALSE)*E12*E12))","v":0},null,null,null,null,null,8.1199999999999992]
[null,null,null,"bold",null,null,0,null,null,null,null,null,44.89]
[null,null,null,"Point",null,null,{"$f":"LARGE(G6:G9,1)+LARGE(G10:G11,1)+LARGE(G12:G13,1)+LARGE(I14:I16,1)","v":0},null,{"$f":"LARGE(G6:G9,2)","v":0}]
[null,null,null,"Mærke",null,null,{"$f":"IF(G14>=G18,D18,IF(G14>=G17,D17,IF(G14>=G16,D16,\"ingen\")))","v":"ingen"},null,{"$f":"LARGE(G10:G11,2)","v":0}]
[null,null,null,"Bronze",null,null,1000,null,{"$f":"LARGE(G12:G13,2)","v":0}]
[null,null,null,"Sølv",null,null,2400]
[null,null,null,"Guld",null,null,3600]

{"sheet":"D9_Resultater","index":1,"n_rows":18,"n_cols":13,"rows_kept":18,"cut":false,"hidden":false,"merged":[[2,4,2,6],[7,10,7,11],[8,10,8,11],[10,10,11,10]]}
[]
[]
[null,null,null,"Køn","Alder"]
[null,null,null,"D",9,null,"år",null,{"$f":"CONCATENATE(\"DAF_\",D4,E4)","v":"DAF_D9"}]
[null,null,null,null,"Res.",null,"Point"]
[null,null,null,"40m",null,null,{"$f":"IF(OR(ISBLANK(E6),E6>VLOOKUP($D6,INDIRECT($I$4),6,FALSE)),0,INT(VLOOKUP($D6,INDIRECT($I$4),2,FALSE)+VLOOKUP($D6,INDIRECT($I$4),3,FALSE)*I6+VLOOKUP($D6,INDIRECT($I$4),4,FALSE)*I6*I6))","v":0},null,{"$f":"IF(F6=\"[Man]\",ROUND(E6,1)+VLOOKUP($D6,INDIRECT($I$4),5,FALSE)/100,E6)","v":0},null,null,null,{"$f":"VLOOKUP($D6,INDIRECT($I$4),7,FALSE)","v":6.3}]
[null,null,null,"400m",null,null,{"$f":"IF(OR(ISBLANK(E7),E7>VLOOKUP($D7,INDIRECT($I$4),6,FALSE)),0,INT(VLOOKUP($D7,INDIRECT($I$4),2,FALSE)+VLOOKUP($D7,INDIRECT($I$4),3,FALSE)*I7+VLOOKUP($D7,INDIRECT($I$4),4,FALSE)*I7*I7))","v":0},null,{"$f":"IF(F7=\"[Man]\",ROUND(E7,1)+VLOOKUP($D7,INDIRECT($I$4),5,FALSE)/100,E7)","v":0},null,null,null,{"$f":"VLOOKUP($D7,INDIRECT($I$4),7,FALSE)","v":72.5}]
[null,null,null,"800m",null,null,{"$f":"IF(OR(ISBLANK(E8), E8>VLOOKUP($D8,INDIRECT($I$4),6,FALSE)),0,INT(VLOOKUP($D8,INDIRECT($I$4),2,FALSE)+VLOOKUP($D8,INDIRECT($I$4),3,FALSE)*E8*86400+VLOOKUP($D8,INDIRECT($I$4),4,FALSE)*E8*86400*E8*86400))","v":0},null,null,"Navn:",null,null,"00:02:32.610"]
[null,null,null,"4x40m",null,null,{"$f":"IF(OR(ISBLANK(E9),E9>VLOOKUP($D9,INDIRECT($I$4),6,FALSE)),0,INT(VLOOKUP($D9,INDIRECT($I$4),2,FALSE)+VLOOKUP($D9,INDIRECT($I$4),3,FALSE)*I9+VLOOKUP($D9,INDIRECT($I$4),4,FALSE)*I9*I9))","v":0},null,{"$f":"IF(F9=\"[Man]\",ROUND(E9,1)+VLOOKUP($D9,INDIRECT($I$4),5,FALSE)/100,E9)","v":0},"Klub:",{"$f":"IF(Info!D29=0,\" \",Info!D29)","v":"Vejle IF"},null,24.91]
[null,null,null,"højde",null,null,{"$f":"IF(OR(ISBLANK(E10), E10<VLOOKUP($D10,INDIRECT($I$4),6,FALSE)),0,INT(VLOOKUP($D10,INDIRECT($I$4),2,FALSE)+VLOOKUP($D10,INDIRECT($I$4),3,FALSE)*E10+VLOOKUP($D10,INDIRECT($I$4),4,FALSE)*E10*E10))","v":0},null,null,"(klub indtastes i Info skemaet)",null,null,1.25]
[null,null,null,"længde",null,null,{"$f":"IF(OR(ISBLANK(E11), E11<VLOOKUP($D11,INDIRECT($I$4),6,FALSE)),0,INT(VLOOKUP($D11,INDIRECT($I$4),2,FALSE)+VLOOKUP($D11,INDIRECT($I$4),3,FALSE)*E11+VLOOKUP($D11,INDIRECT($I$4),4,FALSE)*E11*E11))","v":0},null,null,null,{"$f":"Info!G28","v":"På   diplom"},null,4.01]
[null,null,null,"kugle",null,null,{"$f":"IF(OR(ISBLANK(E12), E12<VLOOKUP($D12,INDIRECT($I$4),6,FALSE)),0,INT(VLOOKUP($D12,INDIRECT($I$4),2,FALSE)+VLOOKUP($D12,INDIRECT($I$4),3,FALSE)*E12+VLOOKUP($D12,INDIRECT($I$4),4,FALSE)*E12*E12))","v":0},null,null,null,null,null,9.81]
[null,null,null,"bold",null,null,0,null,null,null,null,null,52.21]
[null,null,null,"Point",null,null,{"$f":"LARGE(G6:G9,1)+LARGE(G10:G11,1)+LARGE(G12:G13,1)+LARGE(I14:I16,1)","v":0},null,{"$f":"LARGE(G6:G9,2)","v":0}]
[null,null,null,"Mærke",null,null,{"$f":"IF(G14>=G18,D18,IF(G14>=G17,D17,IF(G14>=G16,D16,\"ingen\")))","v":"ingen"},null,{"$f":"LARGE(G10:G11,2)","v":0}]
[null,null,null,"Bronze",null,null,1000,null,{"$f":"LARGE(G12:G13,2)","v":0}]
[null,null,null,"Sølv",null,null,2400]
[null,null,null,"Guld",null,null,3600]

{"sheet":"P10_Resultater","index":2,"n_rows":19,"n_cols":13,"rows_kept":19,"cut":false,"hidden":false,"merged":[[2,4,2,6],[7,10,7,11],[8,10,8,11],[10,10,11,10]]}
[]
[]
[null,null,null,"Køn","Alder"]
[null,null,null,"P",10,null,"år",null,{"$f":"CONCATENATE(\"DAF_\",D4,E4)","v":"DAF_P10"}]
[null,null,null,null,"Res.",null,"Point"]
[null,null,null,"60m",10.039999999999999,null,{"$f":"IF(OR(ISBLANK(E6),E6>VLOOKUP($D6,INDIRECT($I$4),6,FALSE)),0,INT(VLOOKUP($D6,INDIRECT($I$4),2,FALSE)+VLOOKUP($D6,INDIRECT($I$4),3,FALSE)*I6+VLOOKUP($D6,INDIRECT($I$4),4,FALSE)*I6*I6))","v":816},null,{"$f":"IF(F6=\"[Man]\",ROUND(E6,1)+VLOOKUP($D6,INDIRECT($I$4),5,FALSE)/100,E6)","v":10.039999999999999},null,null,null,{"$f":"VLOOKUP($D6,INDIRECT($I$4),7,FALSE)","v":8.86}]
[null,null,null,"400m",null,null,{"$f":"IF(OR(ISBLANK(E7),E7>VLOOKUP($D7,INDIRECT($I$4),6,FALSE)),0,INT(VLOOKUP($D7,INDIRECT($I$4),2,FALSE)+VLOOKUP($D7,INDIRECT($I$4),3,FALSE)*I7+VLOOKUP($D7,INDIRECT($I$4),4,FALSE)*I7*I7))","v":0},null,{"$f":"IF(F7=\"[Man]\",ROUND(E7,1)+VLOOKUP($D7,INDIRECT($I$4),5,FALSE)/100,E7)","v":0},null,null,null,{"$f":"VLOOKUP($D7,INDIRECT($I$4),7,FALSE)","v":63.1}]
[null,null,null,"1000m","00:04:05.670",null,{"$f":"IF(OR(ISBLANK(E8), E8>VLOOKUP($D8,INDIRECT($I$4),6,FALSE)),0,INT(VLOOKUP($D8,INDIRECT($I$4),2,FALSE)+VLOOKUP($D8,INDIRECT($I$4),3,FALSE)*E8*86400+VLOOKUP($D8,INDIRECT($I$4),4,FALSE)*E8*86400*E8*86400))","v":620},null,null,"Navn:",null,null,"00:03:13.520"]
[null,null,null,"60mH",null,null,{"$f":"IF(OR(ISBLANK(E9),E9>VLOOKUP($D9,INDIRECT($I$4),6,FALSE)),0,INT(VLOOKUP($D9,INDIRECT($I$4),2,FALSE)+VLOOKUP($D9,INDIRECT($I$4),3,FALSE)*I9+VLOOKUP($D9,INDIRECT($I$4),4,FALSE)*I9*I9))","v":0},null,{"$f":"IF(F9=\"[Man]\",ROUND(E9,1)+VLOOKUP($D9,INDIRECT($I$4),5,FALSE)/100,E9)","v":0},"Klub:",{"$f":"IF(Info!D29=0,\" \",Info!D29)","v":"Vejle IF"},null,11.15]
[null,null,null,"4x60m",39.07,null,{"$f":"IF(OR(ISBLANK(E10),E10>VLOOKUP($D10,INDIRECT($I$4),6,FALSE)),0,INT(VLOOKUP($D10,INDIRECT($I$4),2,FALSE)+VLOOKUP($D10,INDIRECT($I$4),3,FALSE)*I10+VLOOKUP($D10,INDIRECT($I$4),4,FALSE)*I10*I10))","v":844},null,{"$f":"IF(F10=\"[Man]\",ROUND(E10,1)+VLOOKUP($D10,INDIRECT($I$4),5,FALSE)/100,E10)","v":39.07},"(klub indtastes i Info skemaet)",null,null,34.700000000000003]
[null,null,null,"højde",1.05,null,{"$f":"IF(OR(ISBLANK(E11), E11<VLOOKUP($D11,INDIRECT($I$4),6,FALSE)),0,INT(VLOOKUP($D11,INDIRECT($I$4),2,FALSE)+VLOOKUP($D11,INDIRECT($I$4),3,FALSE)*E11+VLOOKUP($D11,INDIRECT($I$4),4,FALSE)*E11*E11))","v":599},null,null,null,{"$f":"Info!G28","v":"På   diplom"},null,1.46]
[null,null,null,"længde",3.62,null,{"$f":"IF(OR(ISBLANK(E12), E12<VLOOKUP($D12,INDIRECT($I$4),6,FALSE)),0,INT(VLOOKUP($D12,INDIRECT($I$4),2,FALSE)+VLOOKUP($D12,INDIRECT($I$4),3,FALSE)*E12+VLOOKUP($D12,INDIRECT($I$4),4,FALSE)*E12*E12))","v":768},null,null,null,null,null,4.8499999999999996]
[null,null,null,"kugle",4.6900000000000004,null,{"$f":"IF(OR(ISBLANK(E13), E13<VLOOKUP($D13,INDIRECT($I$4),6,FALSE)),0,INT(VLOOKUP($D13,INDIRECT($I$4),2,FALSE)+VLOOKUP($D13,INDIRECT($I$4),3,FALSE)*E13+VLOOKUP($D13,INDIRECT($I$4),4,FALSE)*E13*E13))","v":533},null,null,null,null,null,10.45]
[null,null,null,"bold",null,null,{"$f":"IF(OR(ISBLANK(E14), E14<VLOOKUP($D14,INDIRECT($I$4),6,FALSE)),0,INT(VLOOKUP($D14,INDIRECT($I$4),2,FALSE)+VLOOKUP($D14,INDIRECT($I$4),3,FALSE)*E14+VLOOKUP($D14,INDIRECT($I$4),4,FALSE)*E14*E14))","v":0},null,null,null,null,null,57.97]
[null,null,null,"Point",null,null,{"$f":"LARGE(G6:G10,1)+LARGE(G11:G12,1)+LARGE(G13:G14,1)+LARGE(I15:I17,1)","v":2961},null,{"$f":"LARGE(G6:G10,2)","v":816}]
[null,null,null,"Mærke",null,null,{"$f":"IF(G15>=G19,D19,IF(G15>=G18,D18,IF(G15>=G17,D17,\"ingen\")))","v":"Sølv"},null,{"$f":"LARGE(G11:G12,2)","v":599}]
[null,null,null,"Bronze",null,null,1000,null,{"$f":"LARGE(G13:G14,2)","v":0}]
[null,null,null,"Sølv",null,null,2300]
[null,null,null,"Guld",null,null,3500]

{"sheet":"D10_Resultater","index":3,"n_rows":19,"n_cols":13,"rows_kept":19,"cut":false,"hidden":false,"merged":[[2,4,2,6],[7,10,7,11],[8,10,8,11],[10,10,11,10]]}
[]
[]
[null,null,null,"Køn","Alder"]
[null,null,null,"D",10,null,"år",null,{"$f":"CONCATENATE(\"DAF_\",D4,E4)","v":"DAF_D10"}]
[null,null,null,null,"Res.",null,"Point"]
[null,null,null,"60m",10.41,null,{"$f":"IF(OR(ISBLANK(E6),E6>VLOOKUP($D6,INDIRECT($I$4),6,FALSE)),0,INT(VLOOKUP($D6,INDIRECT($I$4),2,FALSE)+VLOOKUP($D6,INDIRECT($I$4),3,FALSE)*I6+VLOOKUP($D6,INDIRECT($I$4),4,FALSE)*I6*I6))","v":577},null,{"$f":"IF(F6=\"[Man]\",ROUND(E6,1)+VLOOKUP($D6,INDIRECT($I$4),5,FALSE)/100,E6)","v":10.41},null,null,null,{"$f":"VLOOKUP($D6,INDIRECT($I$4),7,FALSE)","v":8.59}]
[null,null,null,"400m",null,null,{"$f":"IF(OR(ISBLANK(E7),E7>VLOOKUP($D7,INDIRECT($I$4),6,FALSE)),0,INT(VLOOKUP($D7,INDIRECT($I$4),2,FALSE)+VLOOKUP($D7,INDIRECT($I$4),3,FALSE)*I7+VLOOKUP($D7,INDIRECT($I$4),4,FALSE)*I7*I7))","v":0},null,{"$f":"IF(F7=\"[Man]\",ROUND(E7,1)+VLOOKUP($D7,INDIRECT($I$4),5,FALSE)/100,E7)","v":0},null,null,null,{"$f":"VLOOKUP($D7,INDIRECT($I$4),7,FALSE)","v":60.79}]
[null,null,null,"1000m","00:04:06.480",null,{"$f":"IF(OR(ISBLANK(E8), E8>VLOOKUP($D8,INDIRECT($I$4),6,FALSE)),0,INT(VLOOKUP($D8,INDIRECT($I$4),2,FALSE)+VLOOKUP($D8,INDIRECT($I$4),3,FALSE)*E8*86400+VLOOKUP($D8,INDIRECT($I$4),4,FALSE)*E8*86400*E8*86400))","v":459},null,null,"Navn:",null,null,"00:03:04.930"]
[null,null,null,"60mH",14.05,null,{"$f":"IF(OR(ISBLANK(E9),E9>VLOOKUP($D9,INDIRECT($I$4),6,FALSE)),0,INT(VLOOKUP($D9,INDIRECT($I$4),2,FALSE)+VLOOKUP($D9,INDIRECT($I$4),3,FALSE)*I9+VLOOKUP($D9,INDIRECT($I$4),4,FALSE)*I9*I9))","v":599},null,{"$f":"IF(F9=\"[Man]\",ROUND(E9,1)+VLOOKUP($D9,INDIRECT($I$4),5,FALSE)/100,E9)","v":14.05},"Klub:",{"$f":"IF(Info!D29=0,\" \",Info!D29)","v":"Vejle IF"},null,10.74]
[null,null,null,"4x60m",null,null,{"$f":"IF(OR(ISBLANK(E10),E10>VLOOKUP($D10,INDIRECT($I$4),6,FALSE)),0,INT(VLOOKUP($D10,INDIRECT($I$4),2,FALSE)+VLOOKUP($D10,INDIRECT($I$4),3,FALSE)*I10+VLOOKUP($D10,INDIRECT($I$4),4,FALSE)*I10*I10))","v":0},null,{"$f":"IF(F10=\"[Man]\",ROUND(E10,1)+VLOOKUP($D10,INDIRECT($I$4),5,FALSE)/100,E10)","v":0},"(klub indtastes i Info skemaet)",null,null,33.64]
[null,null,null,"højde",0.95,null,{"$f":"IF(OR(ISBLANK(E11), E11<VLOOKUP($D11,INDIRECT($I$4),6,FALSE)),0,INT(VLOOKUP($D11,INDIRECT($I$4),2,FALSE)+VLOOKUP($D11,INDIRECT($I$4),3,FALSE)*E11+VLOOKUP($D11,INDIRECT($I$4),4,FALSE)*E11*E11))","v":277},null,null,null,{"$f":"Info!G28","v":"På   diplom"},null,1.52]
[null,null,null,"længde",3.25,null,{"$f":"IF(OR(ISBLANK(E12), E12<VLOOKUP($D12,INDIRECT($I$4),6,FALSE)),0,INT(VLOOKUP($D12,INDIRECT($I$4),2,FALSE)+VLOOKUP($D12,INDIRECT($I$4),3,FALSE)*E12+VLOOKUP($D12,INDIRECT($I$4),4,FALSE)*E12*E12))","v":465},null,null,null,null,null,5.05]
[null,null,null,"kugle",4.66,null,{"$f":"IF(OR(ISBLANK(E13), E13<VLOOKUP($D13,INDIRECT($I$4),6,FALSE)),0,INT(VLOOKUP($D13,INDIRECT($I$4),2,FALSE)+VLOOKUP($D13,INDIRECT($I$4),3,FALSE)*E13+VLOOKUP($D13,INDIRECT($I$4),4,FALSE)*E13*E13))","v":408},null,null,null,null,null,10.61]
[null,null,null,"bold",16.309999999999999,null,{"$f":"IF(OR(ISBLANK(E14), E14<VLOOKUP($D14,INDIRECT($I$4),6,FALSE)),0,INT(VLOOKUP($D14,INDIRECT($I$4),2,FALSE)+VLOOKUP($D14,INDIRECT($I$4),3,FALSE)*E14+VLOOKUP($D14,INDIRECT($I$4),4,FALSE)*E14*E14))","v":22},null,null,null,null,null,59.98]
[null,null,null,"Point",null,null,{"$f":"LARGE(G6:G10,1)+LARGE(G11:G12,1)+LARGE(G13:G14,1)+LARGE(I15:I17,1)","v":2049},null,{"$f":"LARGE(G6:G10,2)","v":577}]
[null,null,null,"Mærke",null,null,{"$f":"IF(G15>=G19,D19,IF(G15>=G18,D18,IF(G15>=G17,D17,\"ingen\")))","v":"Bronze"},null,{"$f":"LARGE(G11:G12,2)","v":277}]
[null,null,null,"Bronze",null,null,1000,null,{"$f":"LARGE(G13:G14,2)","v":22}]
[null,null,null,"Sølv",null,null,2300]
[null,null,null,"Guld",null,null,3500]

{"sheet":"P11_Resultater","index":4,"n_rows":19,"n_cols":13,"rows_kept":19,"cut":false,"hidden":false,"merged":[[2,4,2,6],[7,10,7,11],[8,10,8,11],[10,10,11,10]]}
[]
[]
[null,null,null,"Køn","Alder"]
[null,null,null,"P",11,null,"år",null,{"$f":"CONCATENATE(\"DAF_\",D4,E4)","v":"DAF_P11"}]
[null,null,null,null,"Res.",null,"Point"]
[null,null,null,"60m",null,null,{"$f":"IF(OR(ISBLANK(E6),E6>VLOOKUP($D6,INDIRECT($I$4),6,FALSE)),0,INT(VLOOKUP($D6,INDIRECT($I$4),2,FALSE)+VLOOKUP($D6,INDIRECT($I$4),3,FALSE)*I6+VLOOKUP($D6,INDIRECT($I$4),4,FALSE)*I6*I6))","v":0},null,{"$f":"IF(F6=\"[Man]\",ROUND(E6,1)+VLOOKUP($D6,INDIRECT($I$4),5,FALSE)/100,E6)","v":0},null,null,null,{"$f":"VLOOKUP($D6,INDIRECT($I$4),7,FALSE)","v":8.86}]
[null,null,null,"400m",null,null,{"$f":"IF(OR(ISBLANK(E7),E7>VLOOKUP($D7,INDIRECT($I$4),6,FALSE)),0,INT(VLOOKUP($D7,INDIRECT($I$4),2,FALSE)+VLOOKUP($D7,INDIRECT($I$4),3,FALSE)*I7+VLOOKUP($D7,INDIRECT($I$4),4,FALSE)*I7*I7))","v":0},null,{"$f":"IF(F7=\"[Man]\",ROUND(E7,1)+VLOOKUP($D7,INDIRECT($I$4),5,FALSE)/100,E7)","v":0},null,null,null,{"$f":"VLOOKUP($D7,INDIRECT($I$4),7,FALSE)","v":63.1}]
[null,null,null,"1000m","00:03:58.330",null,{"$f":"IF(OR(ISBLANK(E8), E8>VLOOKUP($D8,INDIRECT($I$4),6,FALSE)),0,INT(VLOOKUP($D8,INDIRECT($I$4),2,FALSE)+VLOOKUP($D8,INDIRECT($I$4),3,FALSE)*E8*86400+VLOOKUP($D8,INDIRECT($I$4),4,FALSE)*E8*86400*E8*86400))","v":692},null,null,"Navn:","Sarah Sækmose Bertelsen",null,"00:03:13.520"]
[null,null,null,"60mH",null,null,{"$f":"IF(OR(ISBLANK(E9),E9>VLOOKUP($D9,INDIRECT($I$4),6,FALSE)),0,INT(VLOOKUP($D9,INDIRECT($I$4),2,FALSE)+VLOOKUP($D9,INDIRECT($I$4),3,FALSE)*I9+VLOOKUP($D9,INDIRECT($I$4),4,FALSE)*I9*I9))","v":0},null,{"$f":"IF(F9=\"[Man]\",ROUND(E9,1)+VLOOKUP($D9,INDIRECT($I$4),5,FALSE)/100,E9)","v":0},"Klub:",{"$f":"IF(Info!D29=0,\" \",Info!D29)","v":"Vejle IF"},null,11.15]
[null,null,null,"4x60m",39.07,null,{"$f":"IF(OR(ISBLANK(E10),E10>VLOOKUP($D10,INDIRECT($I$4),6,FALSE)),0,INT(VLOOKUP($D10,INDIRECT($I$4),2,FALSE)+VLOOKUP($D10,INDIRECT($I$4),3,FALSE)*I10+VLOOKUP($D10,INDIRECT($I$4),4,FALSE)*I10*I10))","v":844},null,{"$f":"IF(F10=\"[Man]\",ROUND(E10,1)+VLOOKUP($D10,INDIRECT($I$4),5,FALSE)/100,E10)","v":39.07},"(klub indtastes i Info skemaet)",null,null,34.700000000000003]
[null,null,null,"højde",1.1000000000000001,null,{"$f":"IF(OR(ISBLANK(E11), E11<VLOOKUP($D11,INDIRECT($I$4),6,FALSE)),0,INT(VLOOKUP($D11,INDIRECT($I$4),2,FALSE)+VLOOKUP($D11,INDIRECT($I$4),3,FALSE)*E11+VLOOKUP($D11,INDIRECT($I$4),4,FALSE)*E11*E11))","v":681},null,null,null,{"$f":"Info!G28","v":"På   diplom"},null,1.46]
[null,null,null,"længde",null,null,{"$f":"IF(OR(ISBLANK(E12), E12<VLOOKUP($D12,INDIRECT($I$4),6,FALSE)),0,INT(VLOOKUP($D12,INDIRECT($I$4),2,FALSE)+VLOOKUP($D12,INDIRECT($I$4),3,FALSE)*E12+VLOOKUP($D12,INDIRECT($I$4),4,FALSE)*E12*E12))","v":0},null,null,null,null,null,4.8499999999999996]
[null,null,null,"kugle",null,null,{"$f":"IF(OR(ISBLANK(E13), E13<VLOOKUP($D13,INDIRECT($I$4),6,FALSE)),0,INT(VLOOKUP($D13,INDIRECT($I$4),2,FALSE)+VLOOKUP($D13,INDIRECT($I$4),3,FALSE)*E13+VLOOKUP($D13,INDIRECT($I$4),4,FALSE)*E13*E13))","v":0},null,null,null,null,null,10.45]
[null,null,null,"bold",null,null,{"$f":"IF(OR(ISBLANK(E14), E14<VLOOKUP($D14,INDIRECT($I$4),6,FALSE)),0,INT(VLOOKUP($D14,INDIRECT($I$4),2,FALSE)+VLOOKUP($D14,INDIRECT($I$4),3,FALSE)*E14+VLOOKUP($D14,INDIRECT($I$4),4,FALSE)*E14*E14))","v":0},null,null,null,null,null,57.97]
[null,null,null,"Point",null,null,{"$f":"LARGE(G6:G10,1)+LARGE(G11:G12,1)+LARGE(G13:G14,1)+LARGE(I15:I17,1)","v":2217},null,{"$f":"LARGE(G6:G10,2)","v":692}]
[null,null,null,"Mærke",null,null,{"$f":"IF(G15>=G19,D19,IF(G15>=G18,D18,IF(G15>=G17,D17,\"ingen\")))","v":"Bronze"},null,{"$f":"LARGE(G11:G12,2)","v":0}]
[null,null,null,"Bronze",null,null,1100,null,{"$f":"LARGE(G13:G14,2)","v":0}]
[null,null,null,"Sølv",null,null,2400]
[null,null,null,"Guld",null,null,3600]

{"sheet":"D11_Resultater","index":5,"n_rows":19,"n_cols":13,"rows_kept":19,"cut":false,"hidden":false,"merged":[[2,4,2,6],[7,10,7,11],[8,10,8,11],[10,10,11,10]]}
[]
[]
[null,null,null,"Køn","Alder"]
[null,null,null,"D",11,null,"år",null,{"$f":"CONCATENATE(\"DAF_\",D4,E4)","v":"DAF_D11"}]
[null,null,null,null,"Res.",null,"Point"]
[null,null,null,"60m",null,null,{"$f":"IF(OR(ISBLANK(E6),E6>VLOOKUP($D6,INDIRECT($I$4),6,FALSE)),0,INT(VLOOKUP($D6,INDIRECT($I$4),2,FALSE)+VLOOKUP($D6,INDIRECT($I$4),3,FALSE)*I6+VLOOKUP($D6,INDIRECT($I$4),4,FALSE)*I6*I6))","v":0},null,{"$f":"IF(F6=\"[Man]\",ROUND(E6,1)+VLOOKUP($D6,INDIRECT($I$4),5,FALSE)/100,E6)","v":0},null,null,null,{"$f":"VLOOKUP($D6,INDIRECT($I$4),7,FALSE)","v":8.59}]
[null,null,null,"400m",null,null,{"$f":"IF(OR(ISBLANK(E7),E7>VLOOKUP($D7,INDIRECT($I$4),6,FALSE)),0,INT(VLOOKUP($D7,INDIRECT($I$4),2,FALSE)+VLOOKUP($D7,INDIRECT($I$4),3,FALSE)*I7+VLOOKUP($D7,INDIRECT($I$4),4,FALSE)*I7*I7))","v":0},null,{"$f":"IF(F7=\"[Man]\",ROUND(E7,1)+VLOOKUP($D7,INDIRECT($I$4),5,FALSE)/100,E7)","v":0},null,null,null,{"$f":"VLOOKUP($D7,INDIRECT($I$4),7,FALSE)","v":60.79}]
[null,null,null,"1000m",null,null,{"$f":"IF(OR(ISBLANK(E8), E8>VLOOKUP($D8,INDIRECT($I$4),6,FALSE)),0,INT(VLOOKUP($D8,INDIRECT($I$4),2,FALSE)+VLOOKUP($D8,INDIRECT($I$4),3,FALSE)*E8*86400+VLOOKUP($D8,INDIRECT($I$4),4,FALSE)*E8*86400*E8*86400))","v":0},null,null,"Navn:",null,null,"00:03:04.930"]
[null,null,null,"60mH",null,null,{"$f":"IF(OR(ISBLANK(E9),E9>VLOOKUP($D9,INDIRECT($I$4),6,FALSE)),0,INT(VLOOKUP($D9,INDIRECT($I$4),2,FALSE)+VLOOKUP($D9,INDIRECT($I$4),3,FALSE)*I9+VLOOKUP($D9,INDIRECT($I$4),4,FALSE)*I9*I9))","v":0},null,{"$f":"IF(F9=\"[Man]\",ROUND(E9,1)+VLOOKUP($D9,INDIRECT($I$4),5,FALSE)/100,E9)","v":0},"Klub:",{"$f":"IF(Info!D29=0,\" \",Info!D29)","v":"Vejle IF"},null,10.74]
[null,null,null,"4x60m",38.18,null,{"$f":"IF(OR(ISBLANK(E10),E10>VLOOKUP($D10,INDIRECT($I$4),6,FALSE)),0,INT(VLOOKUP($D10,INDIRECT($I$4),2,FALSE)+VLOOKUP($D10,INDIRECT($I$4),3,FALSE)*I10+VLOOKUP($D10,INDIRECT($I$4),4,FALSE)*I10*I10))","v":791},null,{"$f":"IF(F10=\"[Man]\",ROUND(E10,1)+VLOOKUP($D10,INDIRECT($I$4),5,FALSE)/100,E10)","v":38.18},"(klub indtastes i Info skemaet)",null,null,33.64]
[null,null,null,"højde",null,null,{"$f":"IF(OR(ISBLANK(E11), E11<VLOOKUP($D11,INDIRECT($I$4),6,FALSE)),0,INT(VLOOKUP($D11,INDIRECT($I$4),2,FALSE)+VLOOKUP($D11,INDIRECT($I$4),3,FALSE)*E11+VLOOKUP($D11,INDIRECT($I$4),4,FALSE)*E11*E11))","v":0},null,null,null,{"$f":"Info!G28","v":"På   diplom"},null,1.52]
[null,null,null,"længde",null,null,{"$f":"IF(OR(ISBLANK(E12), E12<VLOOKUP($D12,INDIRECT($I$4),6,FALSE)),0,INT(VLOOKUP($D12,INDIRECT($I$4),2,FALSE)+VLOOKUP($D12,INDIRECT($I$4),3,FALSE)*E12+VLOOKUP($D12,INDIRECT($I$4),4,FALSE)*E12*E12))","v":0},null,null,null,null,null,5.05]
[null,null,null,"kugle",null,null,{"$f":"IF(OR(ISBLANK(E13), E13<VLOOKUP($D13,INDIRECT($I$4),6,FALSE)),0,INT(VLOOKUP($D13,INDIRECT($I$4),2,FALSE)+VLOOKUP($D13,INDIRECT($I$4),3,FALSE)*E13+VLOOKUP($D13,INDIRECT($I$4),4,FALSE)*E13*E13))","v":0},null,null,null,null,null,10.61]
[null,null,null,"bold",null,null,{"$f":"IF(OR(ISBLANK(E14), E14<VLOOKUP($D14,INDIRECT($I$4),6,FALSE)),0,INT(VLOOKUP($D14,INDIRECT($I$4),2,FALSE)+VLOOKUP($D14,INDIRECT($I$4),3,FALSE)*E14+VLOOKUP($D14,INDIRECT($I$4),4,FALSE)*E14*E14))","v":0},null,null,null,null,null,59.98]
[null,null,null,"Point",null,null,{"$f":"LARGE(G6:G10,1)+LARGE(G11:G12,1)+LARGE(G13:G14,1)+LARGE(I15:I17,1)","v":791},null,{"$f":"LARGE(G6:G10,2)","v":0}]
[null,null,null,"Mærke",null,null,{"$f":"IF(G15>=G19,D19,IF(G15>=G18,D18,IF(G15>=G17,D17,\"ingen\")))","v":"ingen"},null,{"$f":"LARGE(G11:G12,2)","v":0}]
[null,null,null,"Bronze",null,null,1100,null,{"$f":"LARGE(G13:G14,2)","v":0}]
[null,null,null,"Sølv",null,null,2400]
[null,null,null,"Guld",null,null,3600]

{"sheet":"P12_Resultater","index":6,"n_rows":24,"n_cols":13,"rows_kept":24,"cut":false,"hidden":false,"merged":[[2,4,2,6],[7,10,7,11],[8,10,8,11],[10,10,11,10]]}
[]
[]
[null,null,null,"Køn","Alder"]
[null,null,null,"P",12,null,"år",null,{"$f":"CONCATENATE(\"DAF_\",D4,E4)","v":"DAF_P12"}]
[null,null,null,null,"Res.",null,"Point"]
[null,null,null,"80m",12.72,null,{"$f":"IF(OR(ISBLANK(E6),E6>VLOOKUP($D6,INDIRECT($I$4),6,FALSE)),0,INT(VLOOKUP($D6,INDIRECT($I$4),2,FALSE)+VLOOKUP($D6,INDIRECT($I$4),3,FALSE)*I6+VLOOKUP($D6,INDIRECT($I$4),4,FALSE)*I6*I6))","v":364},null,{"$f":"IF(F6=\"[Man]\",ROUND(E6,1)+VLOOKUP($D6,INDIRECT($I$4),5,FALSE)/100,E6)","v":12.72},null,null,null,{"$f":"VLOOKUP($D6,INDIRECT($I$4),7,FALSE)","v":9.76}]
[null,null,null,"200m",null,null,{"$f":"IF(OR(ISBLANK(E7),E7>VLOOKUP($D7,INDIRECT($I$4),6,FALSE)),0,INT(VLOOKUP($D7,INDIRECT($I$4),2,FALSE)+VLOOKUP($D7,INDIRECT($I$4),3,FALSE)*I7+VLOOKUP($D7,INDIRECT($I$4),4,FALSE)*I7*I7))","v":0},null,{"$f":"IF(F7=\"[Man]\",ROUND(E7,1)+VLOOKUP($D7,INDIRECT($I$4),5,FALSE)/100,E7)","v":0},null,null,null,{"$f":"VLOOKUP($D7,INDIRECT($I$4),7,FALSE)","v":24.43}]
[null,null,null,"600m","00:01:57.010",null,{"$f":"IF(OR(ISBLANK(E8), E8>VLOOKUP($D8,INDIRECT($I$4),6,FALSE)),0,INT(VLOOKUP($D8,INDIRECT($I$4),2,FALSE)+VLOOKUP($D8,INDIRECT($I$4),3,FALSE)*E8*86400+VLOOKUP($D8,INDIRECT($I$4),4,FALSE)*E8*86400*E8*86400))","v":844},null,null,"Navn:","Silje Noe",null,"00:01:34.450"]
[null,null,null,"1000m","00:03:28.290",null,{"$f":"IF(OR(ISBLANK(E9), E9>VLOOKUP($D9,INDIRECT($I$4),6,FALSE)),0,INT(VLOOKUP($D9,INDIRECT($I$4),2,FALSE)+VLOOKUP($D9,INDIRECT($I$4),3,FALSE)*E9*86400+VLOOKUP($D9,INDIRECT($I$4),4,FALSE)*E9*86400*E9*86400))","v":481},null,null,"Klub:",{"$f":"IF(Info!D29=0,\" \",Info!D29)","v":"Vejle IF"},null,"00:02:43.160"]
[null,null,null,"60mH",null,null,{"$f":"IF(OR(ISBLANK(E10),E10>VLOOKUP($D10,INDIRECT($I$4),6,FALSE)),0,INT(VLOOKUP($D10,INDIRECT($I$4),2,FALSE)+VLOOKUP($D10,INDIRECT($I$4),3,FALSE)*I10+VLOOKUP($D10,INDIRECT($I$4),4,FALSE)*I10*I10))","v":0},null,{"$f":"IF(F10=\"[Man]\",ROUND(E10,1)+VLOOKUP($D10,INDIRECT($I$4),5,FALSE)/100,E10)","v":0},"(klub indtastes i Info skemaet)",null,null,9.11]
[null,null,null,"4x80m",48.24,null,{"$f":"IF(OR(ISBLANK(E11),E11>VLOOKUP($D11,INDIRECT($I$4),6,FALSE)),0,INT(VLOOKUP($D11,INDIRECT($I$4),2,FALSE)+VLOOKUP($D11,INDIRECT($I$4),3,FALSE)*I11+VLOOKUP($D11,INDIRECT($I$4),4,FALSE)*I11*I11))","v":765},null,{"$f":"IF(F11=\"[Man]\",ROUND(E11,1)+VLOOKUP($D11,INDIRECT($I$4),5,FALSE)/100,E11)","v":48.24},null,{"$f":"Info!G28","v":"På   diplom"},null,40.9]
[null,null,null,"højde",1.1499999999999999,null,{"$f":"IF(OR(ISBLANK(E12), E12<VLOOKUP($D12,INDIRECT($I$4),6,FALSE)),0,INT(VLOOKUP($D12,INDIRECT($I$4),2,FALSE)+VLOOKUP($D12,INDIRECT($I$4),3,FALSE)*E12+VLOOKUP($D12,INDIRECT($I$4),4,FALSE)*E12*E12))","v":572},null,null,null,null,null,1.7]
[null,null,null,"længde",null,null,{"$f":"IF(OR(ISBLANK(E13), E13<VLOOKUP($D13,INDIRECT($I$4),6,FALSE)),0,INT(VLOOKUP($D13,INDIRECT($I$4),2,FALSE)+VLOOKUP($D13,INDIRECT($I$4),3,FALSE)*E13+VLOOKUP($D13,INDIRECT($I$4),4,FALSE)*E13*E13))","v":0},null,null,null,null,null,6.09]
[null,null,null,"stang",null,null,0,null,null,null,null,null,3.48]
[null,null,null,"kugle",6.82,null,{"$f":"IF(OR(ISBLANK(E15), E15<VLOOKUP($D15,INDIRECT($I$4),6,FALSE)),0,INT(VLOOKUP($D15,INDIRECT($I$4),2,FALSE)+VLOOKUP($D15,INDIRECT($I$4),3,FALSE)*E15+VLOOKUP($D15,INDIRECT($I$4),4,FALSE)*E15*E15))","v":507},null,null,null,null,null,14.44]
[null,null,null,"diskos",13.59,null,{"$f":"IF(OR(ISBLANK(E16), E16<VLOOKUP($D16,INDIRECT($I$4),6,FALSE)),0,INT(VLOOKUP($D16,INDIRECT($I$4),2,FALSE)+VLOOKUP($D16,INDIRECT($I$4),3,FALSE)*E16+VLOOKUP($D16,INDIRECT($I$4),4,FALSE)*E16*E16))","v":243},null,null,null,null,null,45.31]
[null,null,null,"hammer",null,null,0,null,null,null,null,null,41.39]
[null,null,null,"spyd",null,null,0,null,null,null,null,null,40.99]
[null,null,null,"bold",null,null,0,null,null,null,null,null,68.819999999999993]
[null,null,null,"Point",null,null,{"$f":"LARGE(G6:G11,1)+LARGE(G12:G14,1)+LARGE(G15:G19,1)+LARGE(I20:I22,1)","v":2688},null,{"$f":"LARGE(G6:G11,2)","v":765}]
[null,null,null,"Mærke",null,null,{"$f":"IF(G20>=G24,D24,IF(G20>=G23,D23,IF(G20>=G22,D22,\"ingen\")))","v":"Sølv"},null,{"$f":"LARGE(G12:G14,2)","v":0}]
[null,null,null,"Bronze",null,null,1000,null,{"$f":"LARGE(G15:G19,2)","v":243}]
[null,null,null,"Sølv",null,null,2000]
[null,null,null,"Guld",null,null,3000]

{"sheet":"D12_Resultater","index":7,"n_rows":24,"n_cols":13,"rows_kept":24,"cut":false,"hidden":false,"merged":[[2,4,2,6],[7,10,7,11],[8,10,8,11],[10,10,11,10]]}
[]
[]
[null,null,null,"Køn","Alder"]
[null,null,null,"D",12,null,"år",null,{"$f":"CONCATENATE(\"DAF_\",D4,E4)","v":"DAF_D12"}]
[null,null,null,null,"Res.",null,"Point"]
[null,null,null,"80m",null,null,{"$f":"IF(OR(ISBLANK(E6),E6>VLOOKUP($D6,INDIRECT($I$4),6,FALSE)),0,INT(VLOOKUP($D6,INDIRECT($I$4),2,FALSE)+VLOOKUP($D6,INDIRECT($I$4),3,FALSE)*I6+VLOOKUP($D6,INDIRECT($I$4),4,FALSE)*I6*I6))","v":0},null,{"$f":"IF(F6=\"[Man]\",ROUND(E6,1)+VLOOKUP($D6,INDIRECT($I$4),5,FALSE)/100,E6)","v":0},null,null,null,{"$f":"VLOOKUP($D6,INDIRECT($I$4),7,FALSE)","v":9.2200000000000006}]
[null,null,null,"200m",null,null,{"$f":"IF(OR(ISBLANK(E7),E7>VLOOKUP($D7,INDIRECT($I$4),6,FALSE)),0,INT(VLOOKUP($D7,INDIRECT($I$4),2,FALSE)+VLOOKUP($D7,INDIRECT($I$4),3,FALSE)*I7+VLOOKUP($D7,INDIRECT($I$4),4,FALSE)*I7*I7))","v":0},null,{"$f":"IF(F7=\"[Man]\",ROUND(E7,1)+VLOOKUP($D7,INDIRECT($I$4),5,FALSE)/100,E7)","v":0},null,null,null,{"$f":"VLOOKUP($D7,INDIRECT($I$4),7,FALSE)","v":22.58}]
[null,null,null,"600m",null,null,{"$f":"IF(OR(ISBLANK(E8), E8>VLOOKUP($D8,INDIRECT($I$4),6,FALSE)),0,INT(VLOOKUP($D8,INDIRECT($I$4),2,FALSE)+VLOOKUP($D8,INDIRECT($I$4),3,FALSE)*E8*86400+VLOOKUP($D8,INDIRECT($I$4),4,FALSE)*E8*86400*E8*86400))","v":0},null,null,"Navn:",null,null,"00:01:31.560"]
[null,null,null,"1000m",null,null,{"$f":"IF(OR(ISBLANK(E9), E9>VLOOKUP($D9,INDIRECT($I$4),6,FALSE)),0,INT(VLOOKUP($D9,INDIRECT($I$4),2,FALSE)+VLOOKUP($D9,INDIRECT($I$4),3,FALSE)*E9*86400+VLOOKUP($D9,INDIRECT($I$4),4,FALSE)*E9*86400*E9*86400))","v":0},null,null,"Klub:",{"$f":"IF(Info!D29=0,\" \",Info!D29)","v":"Vejle IF"},null,"00:02:34.190"]
[null,null,null,"80mH",null,null,{"$f":"IF(OR(ISBLANK(E10),E10>VLOOKUP($D10,INDIRECT($I$4),6,FALSE)),0,INT(VLOOKUP($D10,INDIRECT($I$4),2,FALSE)+VLOOKUP($D10,INDIRECT($I$4),3,FALSE)*I10+VLOOKUP($D10,INDIRECT($I$4),4,FALSE)*I10*I10))","v":0},null,{"$f":"IF(F10=\"[Man]\",ROUND(E10,1)+VLOOKUP($D10,INDIRECT($I$4),5,FALSE)/100,E10)","v":0},"(klub indtastes i Info skemaet)",null,null,10.69]
[null,null,null,"4x80m",null,null,{"$f":"IF(OR(ISBLANK(E11),E11>VLOOKUP($D11,INDIRECT($I$4),6,FALSE)),0,INT(VLOOKUP($D11,INDIRECT($I$4),2,FALSE)+VLOOKUP($D11,INDIRECT($I$4),3,FALSE)*I11+VLOOKUP($D11,INDIRECT($I$4),4,FALSE)*I11*I11))","v":0},null,{"$f":"IF(F11=\"[Man]\",ROUND(E11,1)+VLOOKUP($D11,INDIRECT($I$4),5,FALSE)/100,E11)","v":0},null,{"$f":"Info!G28","v":"På   diplom"},null,38.9]
[null,null,null,"højde",null,null,{"$f":"IF(OR(ISBLANK(E12), E12<VLOOKUP($D12,INDIRECT($I$4),6,FALSE)),0,INT(VLOOKUP($D12,INDIRECT($I$4),2,FALSE)+VLOOKUP($D12,INDIRECT($I$4),3,FALSE)*E12+VLOOKUP($D12,INDIRECT($I$4),4,FALSE)*E12*E12))","v":0},null,null,null,null,null,1.89]
[null,null,null,"længde",null,null,{"$f":"IF(OR(ISBLANK(E13), E13<VLOOKUP($D13,INDIRECT($I$4),6,FALSE)),0,INT(VLOOKUP($D13,INDIRECT($I$4),2,FALSE)+VLOOKUP($D13,INDIRECT($I$4),3,FALSE)*E13+VLOOKUP($D13,INDIRECT($I$4),4,FALSE)*E13*E13))","v":0},null,null,null,null,null,6.41]
[null,null,null,"stang",null,null,0,null,null,null,null,null,3.78]
[null,null,null,"kugle",null,null,{"$f":"IF(OR(ISBLANK(E15), E15<VLOOKUP($D15,INDIRECT($I$4),6,FALSE)),0,INT(VLOOKUP($D15,INDIRECT($I$4),2,FALSE)+VLOOKUP($D15,INDIRECT($I$4),3,FALSE)*E15+VLOOKUP($D15,INDIRECT($I$4),4,FALSE)*E15*E15))","v":0},null,null,null,null,null,16.440000000000001]
[null,null,null,"diskos",null,null,{"$f":"IF(OR(ISBLANK(E16), E16<VLOOKUP($D16,INDIRECT($I$4),6,FALSE)),0,INT(VLOOKUP($D16,INDIRECT($I$4),2,FALSE)+VLOOKUP($D16,INDIRECT($I$4),3,FALSE)*E16+VLOOKUP($D16,INDIRECT($I$4),4,FALSE)*E16*E16))","v":0},null,null,null,null,null,54.88]
[null,null,null,"hammer",null,null,0,null,null,null,null,null,54.88]
[null,null,null,"spyd",null,null,0,null,null,null,null,null,54.9]
[null,null,null,"bold",null,null,0,null,null,null,null,null,84.29]
[null,null,null,"Point",null,null,{"$f":"LARGE(G6:G11,1)+LARGE(G12:G14,1)+LARGE(G15:G19,1)+LARGE(I20:I22,1)","v":0},null,{"$f":"LARGE(G6:G11,2)","v":0}]
[null,null,null,"Mærke",null,null,{"$f":"IF(G20>=G24,D24,IF(G20>=G23,D23,IF(G20>=G22,D22,\"ingen\")))","v":"ingen"},null,{"$f":"LARGE(G12:G14,2)","v":0}]
[null,null,null,"Bronze",null,null,1000,null,{"$f":"LARGE(G15:G19,2)","v":0}]
[null,null,null,"Sølv",null,null,2000]
[null,null,null,"Guld",null,null,3000]

{"sheet":"P13_Resultater","index":8,"n_rows":24,"n_cols":15,"rows_kept":24,"cut":false,"hidden":false,"merged":[[2,4,2,6],[7,10,7,11],[8,10,8,11],[10,10,11,10]]}
[]
[]
[null,null,null,"Køn","Alder"]
[null,null,null,"P",13,null,"år",null,{"$f":"CONCATENATE(\"DAF_\",D4,E4)","v":"DAF_P13"}]
[null,null,null,null,"Res.",null,"Point"]
[null,null,null,"80m",null,null,{"$f":"IF(OR(ISBLANK(E6),E6>VLOOKUP($D6,INDIRECT($I$4),6,FALSE)),0,INT(VLOOKUP($D6,INDIRECT($I$4),2,FALSE)+VLOOKUP($D6,INDIRECT($I$4),3,FALSE)*I6+VLOOKUP($D6,INDIRECT($I$4),4,FALSE)*I6*I6))","v":0},null,{"$f":"IF(F6=\"[Man]\",ROUND(E6,1)+VLOOKUP($D6,INDIRECT($I$4),5,FALSE)/100,E6)","v":0},null,null,null,{"$f":"VLOOKUP($D6,INDIRECT($I$4),7,FALSE)","v":9.76}]
[null,null,null,"200m",null,null,{"$f":"IF(OR(ISBLANK(E7),E7>VLOOKUP($D7,INDIRECT($I$4),6,FALSE)),0,INT(VLOOKUP($D7,INDIRECT($I$4),2,FALSE)+VLOOKUP($D7,INDIRECT($I$4),3,FALSE)*I7+VLOOKUP($D7,INDIRECT($I$4),4,FALSE)*I7*I7))","v":0},null,{"$f":"IF(F7=\"[Man]\",ROUND(E7,1)+VLOOKUP($D7,INDIRECT($I$4),5,FALSE)/100,E7)","v":0},null,null,null,{"$f":"VLOOKUP($D7,INDIRECT($I$4),7,FALSE)","v":24.43}]
[null,null,null,"600m",null,null,{"$f":"IF(OR(ISBLANK(E8), E8>VLOOKUP($D8,INDIRECT($I$4),6,FALSE)),0,INT(VLOOKUP($D8,INDIRECT($I$4),2,FALSE)+VLOOKUP($D8,INDIRECT($I$4),3,FALSE)*E8*86400+VLOOKUP($D8,INDIRECT($I$4),4,FALSE)*E8*86400*E8*86400))","v":0},null,null,"Navn:",null,null,"00:01:34.450"]
[null,null,null,"1000m",null,null,{"$f":"IF(OR(ISBLANK(E9), E9>VLOOKUP($D9,INDIRECT($I$4),6,FALSE)),0,INT(VLOOKUP($D9,INDIRECT($I$4),2,FALSE)+VLOOKUP($D9,INDIRECT($I$4),3,FALSE)*E9*86400+VLOOKUP($D9,INDIRECT($I$4),4,FALSE)*E9*86400*E9*86400))","v":0},null,null,"Klub:",{"$f":"IF(Info!D29=0,\" \",Info!D29)","v":"Vejle IF"},null,"00:02:43.160"]
[null,null,null,"60mH",null,null,{"$f":"IF(OR(ISBLANK(E10),E10>VLOOKUP($D10,INDIRECT($I$4),6,FALSE)),0,INT(VLOOKUP($D10,INDIRECT($I$4),2,FALSE)+VLOOKUP($D10,INDIRECT($I$4),3,FALSE)*I10+VLOOKUP($D10,INDIRECT($I$4),4,FALSE)*I10*I10))","v":0},null,{"$f":"IF(F10=\"[Man]\",ROUND(E10,1)+VLOOKUP($D10,INDIRECT($I$4),5,FALSE)/100,E10)","v":0},"(klub indtastes i Info skemaet)",null,null,9.11]
[null,null,null,"4x80m",45.81,null,{"$f":"IF(OR(ISBLANK(E11),E11>VLOOKUP($D11,INDIRECT($I$4),6,FALSE)),0,INT(VLOOKUP($D11,INDIRECT($I$4),2,FALSE)+VLOOKUP($D11,INDIRECT($I$4),3,FALSE)*I11+VLOOKUP($D11,INDIRECT($I$4),4,FALSE)*I11*I11))","v":899},null,{"$f":"IF(F11=\"[Man]\",ROUND(E11,1)+VLOOKUP($D11,INDIRECT($I$4),5,FALSE)/100,E11)","v":45.81},null,{"$f":"Info!G28","v":"På   diplom"},null,40.9]
[null,null,null,"højde",null,null,{"$f":"IF(OR(ISBLANK(E12), E12<VLOOKUP($D12,INDIRECT($I$4),6,FALSE)),0,INT(VLOOKUP($D12,INDIRECT($I$4),2,FALSE)+VLOOKUP($D12,INDIRECT($I$4),3,FALSE)*E12+VLOOKUP($D12,INDIRECT($I$4),4,FALSE)*E12*E12))","v":0},null,null,null,null,null,1.7]
[null,null,null,"længde",null,null,{"$f":"IF(OR(ISBLANK(E13), E13<VLOOKUP($D13,INDIRECT($I$4),6,FALSE)),0,INT(VLOOKUP($D13,INDIRECT($I$4),2,FALSE)+VLOOKUP($D13,INDIRECT($I$4),3,FALSE)*E13+VLOOKUP($D13,INDIRECT($I$4),4,FALSE)*E13*E13))","v":0},null,null,null,null,null,6.09]
[null,null,null,"stang",null,null,0,null,null,null,null,null,3.48]
[null,null,null,"kugle",null,null,{"$f":"IF(OR(ISBLANK(E15), E15<VLOOKUP($D15,INDIRECT($I$4),6,FALSE)),0,INT(VLOOKUP($D15,INDIRECT($I$4),2,FALSE)+VLOOKUP($D15,INDIRECT($I$4),3,FALSE)*E15+VLOOKUP($D15,INDIRECT($I$4),4,FALSE)*E15*E15))","v":0},null,null,null,null,null,14.44]
[null,null,null,"diskos",null,null,{"$f":"IF(OR(ISBLANK(E16), E16<VLOOKUP($D16,INDIRECT($I$4),6,FALSE)),0,INT(VLOOKUP($D16,INDIRECT($I$4),2,FALSE)+VLOOKUP($D16,INDIRECT($I$4),3,FALSE)*E16+VLOOKUP($D16,INDIRECT($I$4),4,FALSE)*E16*E16))","v":0},null,null,null,null,null,45.31]
[null,null,null,"hammer",null,null,0,null,null,null,null,null,41.39,null," "]
[null,null,null,"spyd",null,null,0,null,null,null,null,null,40.99]
[null,null,null,"bold",null,null,0,null,null,null,null,null,68.819999999999993]
[null,null,null,"Point",null,null,{"$f":"LARGE(G6:G11,1)+LARGE(G12:G14,1)+LARGE(G15:G19,1)+LARGE(I20:I22,1)","v":899},null,{"$f":"LARGE(G6:G11,2)","v":0}]
[null,null,null,"Mærke",null,null,{"$f":"IF(G20>=G24,D24,IF(G20>=G23,D23,IF(G20>=G22,D22,\"ingen\")))","v":"ingen"},null,{"$f":"LARGE(G12:G14,2)","v":0}]
[null,null,null,"Bronze",null,null,1100,null,{"$f":"LARGE(G15:G19,2)","v":0}]
[null,null,null,"Sølv",null,null,2200]
[null,null,null,"Guld",null,null,3200]

{"sheet":"D13_Resultater","index":9,"n_rows":24,"n_cols":13,"rows_kept":24,"cut":false,"hidden":false,"merged":[[2,4,2,6],[7,10,7,11],[8,10,8,11],[10,10,11,10]]}
[]
[]
[null,null,null,"Køn","Alder"]
[null,null,null,"D",13,null,"år",null,{"$f":"CONCATENATE(\"DAF_\",D4,E4)","v":"DAF_D13"}]
[null,null,null,null,"Res.",null,"Point"]
[null,null,null,"80m",null,null,{"$f":"IF(OR(ISBLANK(E6),E6>VLOOKUP($D6,INDIRECT($I$4),6,FALSE)),0,INT(VLOOKUP($D6,INDIRECT($I$4),2,FALSE)+VLOOKUP($D6,INDIRECT($I$4),3,FALSE)*I6+VLOOKUP($D6,INDIRECT($I$4),4,FALSE)*I6*I6))","v":0},null,{"$f":"IF(F6=\"[Man]\",ROUND(E6,1)+VLOOKUP($D6,INDIRECT($I$4),5,FALSE)/100,E6)","v":0},null,null,null,{"$f":"VLOOKUP($D6,INDIRECT($I$4),7,FALSE)","v":9.2200000000000006}]
[null,null,null,"200m",null,null,{"$f":"IF(OR(ISBLANK(E7),E7>VLOOKUP($D7,INDIRECT($I$4),6,FALSE)),0,INT(VLOOKUP($D7,INDIRECT($I$4),2,FALSE)+VLOOKUP($D7,INDIRECT($I$4),3,FALSE)*I7+VLOOKUP($D7,INDIRECT($I$4),4,FALSE)*I7*I7))","v":0},null,{"$f":"IF(F7=\"[Man]\",ROUND(E7,1)+VLOOKUP($D7,INDIRECT($I$4),5,FALSE)/100,E7)","v":0},null,null,null,{"$f":"VLOOKUP($D7,INDIRECT($I$4),7,FALSE)","v":22.58}]
[null,null,null,"600m",null,null,{"$f":"IF(OR(ISBLANK(E8), E8>VLOOKUP($D8,INDIRECT($I$4),6,FALSE)),0,INT(VLOOKUP($D8,INDIRECT($I$4),2,FALSE)+VLOOKUP($D8,INDIRECT($I$4),3,FALSE)*E8*86400+VLOOKUP($D8,INDIRECT($I$4),4,FALSE)*E8*86400*E8*86400))","v":0},null,null,"Navn:","Rasmus Høier Sieverts",null,"00:01:31.560"]
[null,null,null,"1000m",null,null,{"$f":"IF(OR(ISBLANK(E9), E9>VLOOKUP($D9,INDIRECT($I$4),6,FALSE)),0,INT(VLOOKUP($D9,INDIRECT($I$4),2,FALSE)+VLOOKUP($D9,INDIRECT($I$4),3,FALSE)*E9*86400+VLOOKUP($D9,INDIRECT($I$4),4,FALSE)*E9*86400*E9*86400))","v":0},null,null,"Klub:",{"$f":"IF(Info!D29=0,\" \",Info!D29)","v":"Vejle IF"},null,"00:02:34.190"]
[null,null,null,"80mH",null,null,{"$f":"IF(OR(ISBLANK(E10),E10>VLOOKUP($D10,INDIRECT($I$4),6,FALSE)),0,INT(VLOOKUP($D10,INDIRECT($I$4),2,FALSE)+VLOOKUP($D10,INDIRECT($I$4),3,FALSE)*I10+VLOOKUP($D10,INDIRECT($I$4),4,FALSE)*I10*I10))","v":0},null,{"$f":"IF(F10=\"[Man]\",ROUND(E10,1)+VLOOKUP($D10,INDIRECT($I$4),5,FALSE)/100,E10)","v":0},"(klub indtastes i Info skemaet)",null,null,10.69]
[null,null,null,"4x80m",null,null,{"$f":"IF(OR(ISBLANK(E11),E11>VLOOKUP($D11,INDIRECT($I$4),6,FALSE)),0,INT(VLOOKUP($D11,INDIRECT($I$4),2,FALSE)+VLOOKUP($D11,INDIRECT($I$4),3,FALSE)*I11+VLOOKUP($D11,INDIRECT($I$4),4,FALSE)*I11*I11))","v":0},null,{"$f":"IF(F11=\"[Man]\",ROUND(E11,1)+VLOOKUP($D11,INDIRECT($I$4),5,FALSE)/100,E11)","v":0},null,{"$f":"Info!G28","v":"På   diplom"},null,38.9]
[null,null,null,"højde",null,null,{"$f":"IF(OR(ISBLANK(E12), E12<VLOOKUP($D12,INDIRECT($I$4),6,FALSE)),0,INT(VLOOKUP($D12,INDIRECT($I$4),2,FALSE)+VLOOKUP($D12,INDIRECT($I$4),3,FALSE)*E12+VLOOKUP($D12,INDIRECT($I$4),4,FALSE)*E12*E12))","v":0},null,null,null,null,null,1.89]
[null,null,null,"længde",null,null,{"$f":"IF(OR(ISBLANK(E13), E13<VLOOKUP($D13,INDIRECT($I$4),6,FALSE)),0,INT(VLOOKUP($D13,INDIRECT($I$4),2,FALSE)+VLOOKUP($D13,INDIRECT($I$4),3,FALSE)*E13+VLOOKUP($D13,INDIRECT($I$4),4,FALSE)*E13*E13))","v":0},null,null,null,null,null,6.41]
[null,null,null,"stang",null,null,0,null,null,null,null,null,3.78]
[null,null,null,"kugle",null,null,{"$f":"IF(OR(ISBLANK(E15), E15<VLOOKUP($D15,INDIRECT($I$4),6,FALSE)),0,INT(VLOOKUP($D15,INDIRECT($I$4),2,FALSE)+VLOOKUP($D15,INDIRECT($I$4),3,FALSE)*E15+VLOOKUP($D15,INDIRECT($I$4),4,FALSE)*E15*E15))","v":0},null,null,null,null,null,16.440000000000001]
[null,null,null,"diskos",null,null,{"$f":"IF(OR(ISBLANK(E16), E16<VLOOKUP($D16,INDIRECT($I$4),6,FALSE)),0,INT(VLOOKUP($D16,INDIRECT($I$4),2,FALSE)+VLOOKUP($D16,INDIRECT($I$4),3,FALSE)*E16+VLOOKUP($D16,INDIRECT($I$4),4,FALSE)*E16*E16))","v":0},null,null,null,null,null,54.88]
[null,null,null,"hammer",null,null,0,null,null,null,null,null,54.88]
[null,null,null,"spyd",null,null,0,null,null,null,null,null,54.9]
[null,null,null,"bold",null,null,0,null,null,null,null,null,84.29]
[null,null,null,"Point",null,null,{"$f":"LARGE(G6:G11,1)+LARGE(G12:G14,1)+LARGE(G15:G19,1)+LARGE(I20:I22,1)","v":0},null,{"$f":"LARGE(G6:G11,2)","v":0}]
[null,null,null,"Mærke",null,null,{"$f":"IF(G20>=G24,D24,IF(G20>=G23,D23,IF(G20>=G22,D22,\"ingen\")))","v":"ingen"},null,{"$f":"LARGE(G12:G14,2)","v":0}]
[null,null,null,"Bronze",null,null,1100,null,{"$f":"LARGE(G15:G19,2)","v":0}]
[null,null,null,"Sølv",null,null,2200]
[null,null,null,"Guld",null,null,3200]

{"sheet":"P14_Resultater","index":10,"n_rows":29,"n_cols":13,"rows_kept":29,"cut":false,"hidden":false,"merged":[[2,4,2,6],[7,10,7,11],[8,10,8,11],[10,10,11,10]]}
[]
[]
[null,null,null,"Køn","Alder"]
[null,null,null,"P",14,null,"år",null,{"$f":"CONCATENATE(\"DAF_\",D4,E4)","v":"DAF_P14"}]
[null,null,null,null,"Res.",null,"Point"]
[null,null,null,"60m",null,null,{"$f":"IF(OR(ISBLANK(E6),E6>VLOOKUP($D6,INDIRECT($I$4),6,FALSE)),0,INT(VLOOKUP($D6,INDIRECT($I$4),2,FALSE)+VLOOKUP($D6,INDIRECT($I$4),3,FALSE)*I6+VLOOKUP($D6,INDIRECT($I$4),4,FALSE)*I6*I6))","v":0},null,{"$f":"IF(F6=\"[Man]\",ROUND(E6,1)+VLOOKUP($D6,INDIRECT($I$4),5,FALSE)/100,E6)","v":0},null,null,null,{"$f":"VLOOKUP($D6,INDIRECT($I$4),7,FALSE)","v":7.55}]
[null,null,null,"100m",null,null,{"$f":"IF(OR(ISBLANK(E7),E7>VLOOKUP($D7,INDIRECT($I$4),6,FALSE)),0,INT(VLOOKUP($D7,INDIRECT($I$4),2,FALSE)+VLOOKUP($D7,INDIRECT($I$4),3,FALSE)*I7+VLOOKUP($D7,INDIRECT($I$4),4,FALSE)*I7*I7))","v":0},null,{"$f":"IF(F7=\"[Man]\",ROUND(E7,1)+VLOOKUP($D7,INDIRECT($I$4),5,FALSE)/100,E7)","v":0},null,null,null,{"$f":"VLOOKUP($D7,INDIRECT($I$4),7,FALSE)","v":11.35}]
[null,null,null,"200m",null,null,0,null,{"$f":"IF(F8=\"[Man]\",ROUND(E8,1)+VLOOKUP($D8,INDIRECT($I$4),5,FALSE)/100,E8)","v":0},"Navn:",null,null,22.74]
[null,null,null,"300m",null,null,0,null,{"$f":"IF(F9=\"[Man]\",ROUND(E9,1)+VLOOKUP($D9,INDIRECT($I$4),5,FALSE)/100,E9)","v":0},"Klub:",{"$f":"IF(Info!D29=0,\" \",Info!D29)","v":"Vejle IF"},null,36.35]
[null,null,null,"800m",null,null,{"$f":"IF(OR(ISBLANK(E10), E10>VLOOKUP($D10,INDIRECT($I$4),6,FALSE)),0,INT(VLOOKUP($D10,INDIRECT($I$4),2,FALSE)+VLOOKUP($D10,INDIRECT($I$4),3,FALSE)*E10*86400+VLOOKUP($D10,INDIRECT($I$4),4,FALSE)*E10*86400*E10*86400))","v":0},null,null,"(klub indtastes i Info skemaet)",null,null,"00:02:01.950"]
[null,null,null,"1000m",null,null,{"$f":"IF(OR(ISBLANK(E11), E11>VLOOKUP($D11,INDIRECT($I$4),6,FALSE)),0,INT(VLOOKUP($D11,INDIRECT($I$4),2,FALSE)+VLOOKUP($D11,INDIRECT($I$4),3,FALSE)*E11*86400+VLOOKUP($D11,INDIRECT($I$4),4,FALSE)*E11*86400*E11*86400))","v":0},null,null,null,{"$f":"Info!G28","v":"På   diplom"},null,"00:02:37.940"]
[null,null,null,"1500m",null,null,0,null,null,null,null,null,"00:04:09.930"]
[null,null,null,"3000m",null,null,0,null,null,null,null,null,"00:08:54.800"]
[null,null,null,"60mH",null,null,{"$f":"IF(OR(ISBLANK(E14),E14>VLOOKUP($D14,INDIRECT($I$4),6,FALSE)),0,INT(VLOOKUP($D14,INDIRECT($I$4),2,FALSE)+VLOOKUP($D14,INDIRECT($I$4),3,FALSE)*I14+VLOOKUP($D14,INDIRECT($I$4),4,FALSE)*I14*I14))","v":0},null,{"$f":"IF(F14=\"[Man]\",ROUND(E14,1)+VLOOKUP($D14,INDIRECT($I$4),5,FALSE)/100,E14)","v":0},null,null,null,8.2899999999999991]
[null,null,null,"80mH",null,null,0,null,{"$f":"IF(F15=\"[Man]\",ROUND(E15,1)+VLOOKUP($D15,INDIRECT($I$4),5,FALSE)/100,E15)","v":0},null,null,null,10.69]
[null,null,null,"300mH",null,null,0,null,{"$f":"IF(F16=\"[Man]\",ROUND(E16,1)+VLOOKUP($D16,INDIRECT($I$4),5,FALSE)/100,E16)","v":0},null,null,null,39.93]
[null,null,null,"4x100m",null,null,0,null,{"$f":"IF(F17=\"[Man]\",ROUND(E17,1)+VLOOKUP($D17,INDIRECT($I$4),5,FALSE)/100,E17)","v":0},null,null,null,45.09]
[null,null,null,"højde",null,null,{"$f":"IF(OR(ISBLANK(E18), E18<VLOOKUP($D18,INDIRECT($I$4),6,FALSE)),0,INT(VLOOKUP($D18,INDIRECT($I$4),2,FALSE)+VLOOKUP($D18,INDIRECT($I$4),3,FALSE)*E18+VLOOKUP($D18,INDIRECT($I$4),4,FALSE)*E18*E18))","v":0},null,null,null,null,null,1.89]
[null,null,null,"længde",null,null,{"$f":"IF(OR(ISBLANK(E19), E19<VLOOKUP($D19,INDIRECT($I$4),6,FALSE)),0,INT(VLOOKUP($D19,INDIRECT($I$4),2,FALSE)+VLOOKUP($D19,INDIRECT($I$4),3,FALSE)*E19+VLOOKUP($D19,INDIRECT($I$4),4,FALSE)*E19*E19))","v":0},null,null,null,null,null,6.48]
[null,null,null,"stang",null,null,{"$f":"IF(OR(ISBLANK(E20), E20<VLOOKUP($D20,INDIRECT($I$4),6,FALSE)),0,INT(VLOOKUP($D20,INDIRECT($I$4),2,FALSE)+VLOOKUP($D20,INDIRECT($I$4),3,FALSE)*E20+VLOOKUP($D20,INDIRECT($I$4),4,FALSE)*E20*E20))","v":0},null,null,null,null,null,3.78]
[null,null,null,"kugle",null,null,0,null,null,null,null,null,17.559999999999999]
[null,null,null,"diskos",null,null,0,null,null,null,null,null,56.46]
[null,null,null,"hammer",null,null,{"$f":"IF(OR(ISBLANK(E23), E23<VLOOKUP($D23,INDIRECT($I$4),6,FALSE)),0,INT(VLOOKUP($D23,INDIRECT($I$4),2,FALSE)+VLOOKUP($D23,INDIRECT($I$4),3,FALSE)*E23+VLOOKUP($D23,INDIRECT($I$4),4,FALSE)*E23*E23))","v":0},null,null,null,null,null,56.27]
[null,null,null,"spyd",null,null,0,null,null,null,null,null,69.599999999999994]
[null,null,null,"Point",null,null,{"$f":"LARGE(G6:G17,1)+LARGE(G18:G20,1)+LARGE(G21:G24,1)+LARGE(I26:I28,1)","v":0}]
[null,null,null,"Mærke",null,null,{"$f":"IF(G25>=G29,D29,IF(G25>=G28,D28,IF(G25>=G27,D27,\"ingen\")))","v":"ingen"},null,{"$f":"LARGE(G6:G17,2)","v":0}]
[null,null,null,"Bronze",null,null,1000,null,{"$f":"LARGE(G18:G20,2)","v":0}]
[null,null,null,"Sølv",null,null,2000,null,{"$f":"LARGE(G21:G24,2)","v":0}]
[null,null,null,"Guld",null,null,2800]

{"sheet":"D14_Resultater","index":11,"n_rows":30,"n_cols":13,"rows_kept":30,"cut":false,"hidden":false,"merged":[[2,4,2,6],[7,10,7,11],[8,10,8,11],[10,10,11,10]]}
[]
[]
[null,null,null,"Køn","Alder"]
[null,null,null,"D",14,null,"år",null,{"$f":"CONCATENATE(\"DAF_\",D4,E4)","v":"DAF_D14"}]
[null,null,null,null,"Res.",null,"Point"]
[null,null,null,"60m",null,null,{"$f":"IF(OR(ISBLANK(E6),E6>VLOOKUP($D6,INDIRECT($I$4),6,FALSE)),0,INT(VLOOKUP($D6,INDIRECT($I$4),2,FALSE)+VLOOKUP($D6,INDIRECT($I$4),3,FALSE)*I6+VLOOKUP($D6,INDIRECT($I$4),4,FALSE)*I6*I6))","v":0},null,{"$f":"IF(F6=\"[Man]\",ROUND(E6,1)+VLOOKUP($D6,INDIRECT($I$4),5,FALSE)/100,E6)","v":0},null,null,null,{"$f":"VLOOKUP($D6,INDIRECT($I$4),7,FALSE)","v":7.05}]
[null,null,null,"100m",null,null,{"$f":"IF(OR(ISBLANK(E7),E7>VLOOKUP($D7,INDIRECT($I$4),6,FALSE)),0,INT(VLOOKUP($D7,INDIRECT($I$4),2,FALSE)+VLOOKUP($D7,INDIRECT($I$4),3,FALSE)*I7+VLOOKUP($D7,INDIRECT($I$4),4,FALSE)*I7*I7))","v":0},null,{"$f":"IF(F7=\"[Man]\",ROUND(E7,1)+VLOOKUP($D7,INDIRECT($I$4),5,FALSE)/100,E7)","v":0},null,null,null,{"$f":"VLOOKUP($D7,INDIRECT($I$4),7,FALSE)","v":10.38}]
[null,null,null,"200m",null,null,0,null,{"$f":"IF(F8=\"[Man]\",ROUND(E8,1)+VLOOKUP($D8,INDIRECT($I$4),5,FALSE)/100,E8)","v":0},"Navn:",null,null,20.78]
[null,null,null,"300m",null,null,0,null,{"$f":"IF(F9=\"[Man]\",ROUND(E9,1)+VLOOKUP($D9,INDIRECT($I$4),5,FALSE)/100,E9)","v":0},"Klub:",{"$f":"IF(Info!D29=0,\" \",Info!D29)","v":"Vejle IF"},null,34.229999999999997]
[null,null,null,"800m",null,null,{"$f":"IF(OR(ISBLANK(E10), E10>VLOOKUP($D10,INDIRECT($I$4),6,FALSE)),0,INT(VLOOKUP($D10,INDIRECT($I$4),2,FALSE)+VLOOKUP($D10,INDIRECT($I$4),3,FALSE)*E10*86400+VLOOKUP($D10,INDIRECT($I$4),4,FALSE)*E10*86400*E10*86400))","v":0},null,null,"(klub indtastes i Info skemaet)",null,null,"00:01:48.980"]
[null,null,null,"1000m",null,null,{"$f":"IF(OR(ISBLANK(E11), E11>VLOOKUP($D11,INDIRECT($I$4),6,FALSE)),0,INT(VLOOKUP($D11,INDIRECT($I$4),2,FALSE)+VLOOKUP($D11,INDIRECT($I$4),3,FALSE)*E11*86400+VLOOKUP($D11,INDIRECT($I$4),4,FALSE)*E11*86400*E11*86400))","v":0},null,null,null,{"$f":"Info!G28","v":"På   diplom"},null,"00:02:20.750"]
[null,null,null,"1500m",null,null,0,null,null,null,null,null,"00:03:43.970"]
[null,null,null,"3000m",null,null,0,null,null,null,null,null,"00:08:05.020"]
[null,null,null,"60mH",null,null,{"$f":"IF(OR(ISBLANK(E14),E14>VLOOKUP($D14,INDIRECT($I$4),6,FALSE)),0,INT(VLOOKUP($D14,INDIRECT($I$4),2,FALSE)+VLOOKUP($D14,INDIRECT($I$4),3,FALSE)*I14+VLOOKUP($D14,INDIRECT($I$4),4,FALSE)*I14*I14))","v":0},null,{"$f":"IF(F14=\"[Man]\",ROUND(E14,1)+VLOOKUP($D14,INDIRECT($I$4),5,FALSE)/100,E14)","v":0},null,null,null,8.07]
[null,null,null,"100mH",null,null,0,null,{"$f":"IF(F15=\"[Man]\",ROUND(E15,1)+VLOOKUP($D15,INDIRECT($I$4),5,FALSE)/100,E15)","v":0},null,null,null,12.92]
[null,null,null,"300mH",null,null,0,null,{"$f":"IF(F16=\"[Man]\",ROUND(E16,1)+VLOOKUP($D16,INDIRECT($I$4),5,FALSE)/100,E16)","v":0},null,null,null,35.97]
[null,null,null,"1500mFH",null,null,{"$f":"IF(OR(ISBLANK(E17), E17>VLOOKUP($D17,INDIRECT($I$4),6,FALSE)),0,INT(VLOOKUP($D17,INDIRECT($I$4),2,FALSE)+VLOOKUP($D17,INDIRECT($I$4),3,FALSE)*E17*86400+VLOOKUP($D17,INDIRECT($I$4),4,FALSE)*E17*86400*E17*86400))","v":0},null,null,null,null,null,"00:04:04.830"]
[null,null,null,"4x100m",null,null,0,null,{"$f":"IF(F18=\"[Man]\",ROUND(E18,1)+VLOOKUP($D18,INDIRECT($I$4),5,FALSE)/100,E18)","v":0},null,null,null,42.85]
[null,null,null,"højde",null,null,{"$f":"IF(OR(ISBLANK(E19), E19<VLOOKUP($D19,INDIRECT($I$4),6,FALSE)),0,INT(VLOOKUP($D19,INDIRECT($I$4),2,FALSE)+VLOOKUP($D19,INDIRECT($I$4),3,FALSE)*E19+VLOOKUP($D19,INDIRECT($I$4),4,FALSE)*E19*E19))","v":0},null,null,null,null,null,2.21]
[null,null,null,"længde",null,null,{"$f":"IF(OR(ISBLANK(E20), E20<VLOOKUP($D20,INDIRECT($I$4),6,FALSE)),0,INT(VLOOKUP($D20,INDIRECT($I$4),2,FALSE)+VLOOKUP($D20,INDIRECT($I$4),3,FALSE)*E20+VLOOKUP($D20,INDIRECT($I$4),4,FALSE)*E20*E20))","v":0},null,null,null,null,null,7.8]
[null,null,null,"stang",null,null,0,null,null,null,null,null,5.27]
[null,null,null,"kugle",null,null,{"$f":"IF(OR(ISBLANK(E22), E22<VLOOKUP($D22,INDIRECT($I$4),6,FALSE)),0,INT(VLOOKUP($D22,INDIRECT($I$4),2,FALSE)+VLOOKUP($D22,INDIRECT($I$4),3,FALSE)*E22+VLOOKUP($D22,INDIRECT($I$4),4,FALSE)*E22*E22))","v":0},null,null,null,null,null,20.64]
[null,null,null,"diskos",null,null,{"$f":"IF(OR(ISBLANK(E23), E23<VLOOKUP($D23,INDIRECT($I$4),6,FALSE)),0,INT(VLOOKUP($D23,INDIRECT($I$4),2,FALSE)+VLOOKUP($D23,INDIRECT($I$4),3,FALSE)*E23+VLOOKUP($D23,INDIRECT($I$4),4,FALSE)*E23*E23))","v":0},null,null,null,null,null,67.83]
[null,null,null,"hammer",null,null,{"$f":"IF(OR(ISBLANK(E24), E24<VLOOKUP($D24,INDIRECT($I$4),6,FALSE)),0,INT(VLOOKUP($D24,INDIRECT($I$4),2,FALSE)+VLOOKUP($D24,INDIRECT($I$4),3,FALSE)*E24+VLOOKUP($D24,INDIRECT($I$4),4,FALSE)*E24*E24))","v":0},null,null,null,null,null,67.83]
[null,null,null,"spyd",null,null,0,null,null,null,null,null,85.29]
[null,null,null,"Point",null,null,{"$f":"LARGE(G6:G18,1)+LARGE(G19:G21,1)+LARGE(G22:G25,1)+LARGE(I26:I28,1)","v":0},null,{"$f":"LARGE(G6:G18,2)","v":0}]
[null,null,null,"Mærke",null,null,{"$f":"IF(G26>=G30,D30,IF(G26>=G29,D29,IF(G26>=G28,D28,\"ingen\")))","v":"ingen"},null,{"$f":"LARGE(G19:G21,2)","v":0}]
[null,null,null,"Bronze",null,null,1000,null,{"$f":"LARGE(G22:G25,2)","v":0}]
[null,null,null,"Sølv",null,null,2000]
[null,null,null,"Guld",null,null,2800]

{"sheet":"P15_Resultater","index":12,"n_rows":29,"n_cols":13,"rows_kept":29,"cut":false,"hidden":false,"merged":[[2,4,2,6],[7,10,7,11],[8,10,8,11],[10,10,11,10]]}
[]
[]
[null,null,null,"Køn","Alder"]
[null,null,null,"P",15,null,"år",null,{"$f":"CONCATENATE(\"DAF_\",D4,E4)","v":"DAF_P15"}]
[null,null,null,null,null,null,"Point"]
[null,null,null,"60m",null,null,{"$f":"IF(OR(ISBLANK(E6),E6>VLOOKUP($D6,INDIRECT($I$4),6,FALSE)),0,INT(VLOOKUP($D6,INDIRECT($I$4),2,FALSE)+VLOOKUP($D6,INDIRECT($I$4),3,FALSE)*I6+VLOOKUP($D6,INDIRECT($I$4),4,FALSE)*I6*I6))","v":0},null,{"$f":"IF(F6=\"[Man]\",ROUND(E6,1)+VLOOKUP($D6,INDIRECT($I$4),5,FALSE)/100,E6)","v":0},null,null,null,{"$f":"VLOOKUP($D6,INDIRECT($I$4),7,FALSE)","v":7.55}]
[null,null,null,"100m",null,null,{"$f":"IF(OR(ISBLANK(E7),E7>VLOOKUP($D7,INDIRECT($I$4),6,FALSE)),0,INT(VLOOKUP($D7,INDIRECT($I$4),2,FALSE)+VLOOKUP($D7,INDIRECT($I$4),3,FALSE)*I7+VLOOKUP($D7,INDIRECT($I$4),4,FALSE)*I7*I7))","v":0},null,{"$f":"IF(F7=\"[Man]\",ROUND(E7,1)+VLOOKUP($D7,INDIRECT($I$4),5,FALSE)/100,E7)","v":0},null,null,null,{"$f":"VLOOKUP($D7,INDIRECT($I$4),7,FALSE)","v":11.35}]
[null,null,null,"200m",null,null,0,null,0,"Navn:",null,null,22.74]
[null,null,null,"300m",null,null,0,null,0,"Klub:",{"$f":"IF(Info!D29=0,\" \",Info!D29)","v":"Vejle IF"},null,36.35]
[null,null,null,"800m",null,null,{"$f":"IF(OR(ISBLANK(E10), E10>VLOOKUP($D10,INDIRECT($I$4),6,FALSE)),0,INT(VLOOKUP($D10,INDIRECT($I$4),2,FALSE)+VLOOKUP($D10,INDIRECT($I$4),3,FALSE)*E10*86400+VLOOKUP($D10,INDIRECT($I$4),4,FALSE)*E10*86400*E10*86400))","v":0},null,null,"(klub indtastes i Info skemaet)",null,null,"00:02:01.950"]
[null,null,null,"1000m",null,null,{"$f":"IF(OR(ISBLANK(E11), E11>VLOOKUP($D11,INDIRECT($I$4),6,FALSE)),0,INT(VLOOKUP($D11,INDIRECT($I$4),2,FALSE)+VLOOKUP($D11,INDIRECT($I$4),3,FALSE)*E11*86400+VLOOKUP($D11,INDIRECT($I$4),4,FALSE)*E11*86400*E11*86400))","v":0},null,null,null,{"$f":"Info!G28","v":"På   diplom"},null,"00:02:37.940"]
[null,null,null,"1500m",null,null,0,null,null,null,null,null,"00:04:09.930"]
[null,null,null,"3000m",null,null,0,null,null,null,null,null,"00:08:54.800"]
[null,null,null,"60mH",null,null,{"$f":"IF(OR(ISBLANK(E14),E14>VLOOKUP($D14,INDIRECT($I$4),6,FALSE)),0,INT(VLOOKUP($D14,INDIRECT($I$4),2,FALSE)+VLOOKUP($D14,INDIRECT($I$4),3,FALSE)*I14+VLOOKUP($D14,INDIRECT($I$4),4,FALSE)*I14*I14))","v":0},null,{"$f":"IF(F14=\"[Man]\",ROUND(E14,1)+VLOOKUP($D14,INDIRECT($I$4),5,FALSE)/100,E14)","v":0},null,null,null,8.2899999999999991]
[null,null,null,"80mH",null,null,0,null,{"$f":"IF(F15=\"[Man]\",ROUND(E15,1)+VLOOKUP($D15,INDIRECT($I$4),5,FALSE)/100,E15)","v":0}," ",null,null,10.69]
[null,null,null,"300mH",null,null,0,null,0,null,null,null,39.93]
[null,null,null,"4x100m",null,null,0,null,0,null,null,null,45.09]
[null,null,null,"højde",null,null,{"$f":"IF(OR(ISBLANK(E18), E18<VLOOKUP($D18,INDIRECT($I$4),6,FALSE)),0,INT(VLOOKUP($D18,INDIRECT($I$4),2,FALSE)+VLOOKUP($D18,INDIRECT($I$4),3,FALSE)*E18+VLOOKUP($D18,INDIRECT($I$4),4,FALSE)*E18*E18))","v":0},null,null," ",null,null,1.89]
[null,null,null,"længde",null,null,{"$f":"IF(OR(ISBLANK(E19), E19<VLOOKUP($D19,INDIRECT($I$4),6,FALSE)),0,INT(VLOOKUP($D19,INDIRECT($I$4),2,FALSE)+VLOOKUP($D19,INDIRECT($I$4),3,FALSE)*E19+VLOOKUP($D19,INDIRECT($I$4),4,FALSE)*E19*E19))","v":0},null,null,null,null,null,6.48]
[null,null,null,"stang",null,null,{"$f":"IF(OR(ISBLANK(E20), E20<VLOOKUP($D20,INDIRECT($I$4),6,FALSE)),0,INT(VLOOKUP($D20,INDIRECT($I$4),2,FALSE)+VLOOKUP($D20,INDIRECT($I$4),3,FALSE)*E20+VLOOKUP($D20,INDIRECT($I$4),4,FALSE)*E20*E20))","v":0},null,null,null,null,null,3.78]
[null,null,null,"kugle",null,null,{"$f":"IF(OR(ISBLANK(E21), E21<VLOOKUP($D21,INDIRECT($I$4),6,FALSE)),0,INT(VLOOKUP($D21,INDIRECT($I$4),2,FALSE)+VLOOKUP($D21,INDIRECT($I$4),3,FALSE)*E21+VLOOKUP($D21,INDIRECT($I$4),4,FALSE)*E21*E21))","v":0},null,null,null,null,null,17.559999999999999]
[null,null,null,"diskos",null,null,0,null,null,null,null,null,56.46]
[null,null,null,"hammer",null,null,{"$f":"IF(OR(ISBLANK(E23), E23<VLOOKUP($D23,INDIRECT($I$4),6,FALSE)),0,INT(VLOOKUP($D23,INDIRECT($I$4),2,FALSE)+VLOOKUP($D23,INDIRECT($I$4),3,FALSE)*E23+VLOOKUP($D23,INDIRECT($I$4),4,FALSE)*E23*E23))","v":0},null,null,null,null,null,56.27]
[null,null,null,"spyd",null,null,0,null,null,null,null,null,69.599999999999994]
[null,null,null,"Point",null,null,{"$f":"LARGE(G6:G17,1)+LARGE(G18:G20,1)+LARGE(G21:G24,1)+LARGE(I26:I28,1)","v":0}]
[null,null,null,"Mærke",null,null,{"$f":"IF(G25>=G29,D29,IF(G25>=G28,D28,IF(G25>=G27,D27,\"ingen\")))","v":"ingen"},null,{"$f":"LARGE(G6:G17,2)","v":0}]
[null,null,null,"Bronze",null,null,1100,null,{"$f":"LARGE(G18:G20,2)","v":0}]
[null,null,null,"Sølv",null,null,2200,null,{"$f":"LARGE(G21:G24,2)","v":0}]
[null,null,null,"Guld",null,null,3000]

{"sheet":"D15_Resultater","index":13,"n_rows":30,"n_cols":13,"rows_kept":30,"cut":false,"hidden":false,"merged":[[2,4,2,6],[7,10,7,11],[8,10,8,11],[10,10,11,10]]}
[]
[]
[null,null,null,"Køn","Alder"]
[null,null,null,"D",15,null,"år",null,{"$f":"CONCATENATE(\"DAF_\",D4,E4)","v":"DAF_D15"}]
[null,null,null,null,"Res.",null,"Point"]
[null,null,null,"60m",null,null,{"$f":"IF(OR(ISBLANK(E6),E6>VLOOKUP($D6,INDIRECT($I$4),6,FALSE)),0,INT(VLOOKUP($D6,INDIRECT($I$4),2,FALSE)+VLOOKUP($D6,INDIRECT($I$4),3,FALSE)*I6+VLOOKUP($D6,INDIRECT($I$4),4,FALSE)*I6*I6))","v":0},null,{"$f":"IF(F6=\"[Man]\",ROUND(E6,1)+VLOOKUP($D6,INDIRECT($I$4),5,FALSE)/100,E6)","v":0},null,null,null,{"$f":"VLOOKUP($D6,INDIRECT($I$4),7,FALSE)","v":7.05}]
[null,null,null,"100m",null,null,{"$f":"IF(OR(ISBLANK(E7),E7>VLOOKUP($D7,INDIRECT($I$4),6,FALSE)),0,INT(VLOOKUP($D7,INDIRECT($I$4),2,FALSE)+VLOOKUP($D7,INDIRECT($I$4),3,FALSE)*I7+VLOOKUP($D7,INDIRECT($I$4),4,FALSE)*I7*I7))","v":0},null,{"$f":"IF(F7=\"[Man]\",ROUND(E7,1)+VLOOKUP($D7,INDIRECT($I$4),5,FALSE)/100,E7)","v":0},null,null,null,{"$f":"VLOOKUP($D7,INDIRECT($I$4),7,FALSE)","v":10.38}]
[null,null,null,"200m",null,null,0,null,0,"Navn:",null,null,20.78]
[null,null,null,"300m",null,null,0,null,0,"Klub:",{"$f":"IF(Info!D29=0,\" \",Info!D29)","v":"Vejle IF"},null,34.229999999999997]
[null,null,null,"800m",null,null,{"$f":"IF(OR(ISBLANK(E10), E10>VLOOKUP($D10,INDIRECT($I$4),6,FALSE)),0,INT(VLOOKUP($D10,INDIRECT($I$4),2,FALSE)+VLOOKUP($D10,INDIRECT($I$4),3,FALSE)*E10*86400+VLOOKUP($D10,INDIRECT($I$4),4,FALSE)*E10*86400*E10*86400))","v":0},null,null,"(klub indtastes i Info skemaet)",null,null,"00:01:48.980"]
[null,null,null,"1000m",null,null,{"$f":"IF(OR(ISBLANK(E11), E11>VLOOKUP($D11,INDIRECT($I$4),6,FALSE)),0,INT(VLOOKUP($D11,INDIRECT($I$4),2,FALSE)+VLOOKUP($D11,INDIRECT($I$4),3,FALSE)*E11*86400+VLOOKUP($D11,INDIRECT($I$4),4,FALSE)*E11*86400*E11*86400))","v":0},null,null,null,{"$f":"Info!G28","v":"På   diplom"},null,"00:02:20.750"]
[null,null,null,"1500m",null,null,0,null,null,null,null,null,"00:03:43.970"]
[null,null,null,"3000m",null,null,0,null,null,null,null,null,"00:08:05.020"]
[null,null,null,"60mH",null,null,{"$f":"IF(OR(ISBLANK(E14),E14>VLOOKUP($D14,INDIRECT($I$4),6,FALSE)),0,INT(VLOOKUP($D14,INDIRECT($I$4),2,FALSE)+VLOOKUP($D14,INDIRECT($I$4),3,FALSE)*I14+VLOOKUP($D14,INDIRECT($I$4),4,FALSE)*I14*I14))","v":0},null,{"$f":"IF(F14=\"[Man]\",ROUND(E14,1)+VLOOKUP($D14,INDIRECT($I$4),5,FALSE)/100,E14)","v":0},null,null,null,8.07]
[null,null,null,"100mH",null,null,0,null,0,null,null,null,12.92]
[null,null,null,"300mH",null,null,0,null,0,null,null,null,35.97]
[null,null,null,"1500mFH",null,null,{"$f":"IF(OR(ISBLANK(E17), E17>VLOOKUP($D17,INDIRECT($I$4),6,FALSE)),0,INT(VLOOKUP($D17,INDIRECT($I$4),2,FALSE)+VLOOKUP($D17,INDIRECT($I$4),3,FALSE)*E17*86400+VLOOKUP($D17,INDIRECT($I$4),4,FALSE)*E17*86400*E17*86400))","v":0},null,null,null,null,null,"00:04:04.830"]
[null,null,null,"4x100m",null,null,0,null,0,null,null,null,42.85]
[null,null,null,"højde",null,null,{"$f":"IF(OR(ISBLANK(E19), E19<VLOOKUP($D19,INDIRECT($I$4),6,FALSE)),0,INT(VLOOKUP($D19,INDIRECT($I$4),2,FALSE)+VLOOKUP($D19,INDIRECT($I$4),3,FALSE)*E19+VLOOKUP($D19,INDIRECT($I$4),4,FALSE)*E19*E19))","v":0},null,null,null,null,null,2.21]
[null,null,null,"længde",null,null,{"$f":"IF(OR(ISBLANK(E20), E20<VLOOKUP($D20,INDIRECT($I$4),6,FALSE)),0,INT(VLOOKUP($D20,INDIRECT($I$4),2,FALSE)+VLOOKUP($D20,INDIRECT($I$4),3,FALSE)*E20+VLOOKUP($D20,INDIRECT($I$4),4,FALSE)*E20*E20))","v":0},null,null,null,null,null,7.8]
[null,null,null,"stang",null,null,0,null,null,null,null,null,5.27]
[null,null,null,"kugle",null,null,{"$f":"IF(OR(ISBLANK(E22), E22<VLOOKUP($D22,INDIRECT($I$4),6,FALSE)),0,INT(VLOOKUP($D22,INDIRECT($I$4),2,FALSE)+VLOOKUP($D22,INDIRECT($I$4),3,FALSE)*E22+VLOOKUP($D22,INDIRECT($I$4),4,FALSE)*E22*E22))","v":0},null,null,null,null,null,20.64]
[null,null,null,"diskos",null,null,{"$f":"IF(OR(ISBLANK(E23), E23<VLOOKUP($D23,INDIRECT($I$4),6,FALSE)),0,INT(VLOOKUP($D23,INDIRECT($I$4),2,FALSE)+VLOOKUP($D23,INDIRECT($I$4),3,FALSE)*E23+VLOOKUP($D23,INDIRECT($I$4),4,FALSE)*E23*E23))","v":0},null,null,null,null,null,67.83]
[null,null,null,"hammer",null,null,{"$f":"IF(OR(ISBLANK(E24), E24<VLOOKUP($D24,INDIRECT($I$4),6,FALSE)),0,INT(VLOOKUP($D24,INDIRECT($I$4),2,FALSE)+VLOOKUP($D24,INDIRECT($I$4),3,FALSE)*E24+VLOOKUP($D24,INDIRECT($I$4),4,FALSE)*E24*E24))","v":0},null,null," ",null,null,67.83]
[null,null,null,"spyd",null,null,0,null,null,null,null,null,85.29]
[null,null,null,"Point",null,null,{"$f":"LARGE(G6:G18,1)+LARGE(G19:G21,1)+LARGE(G22:G25,1)+LARGE(I26:I28,1)","v":0},null,{"$f":"LARGE(G6:G18,2)","v":0}]
[null,null,null,"Mærke",null,null,{"$f":"IF(G26>=G30,D30,IF(G26>=G29,D29,IF(G26>=G28,D28,\"ingen\")))","v":"ingen"},null,{"$f":"LARGE(G19:G21,2)","v":0}]
[null,null,null,"Bronze",null,null,1100,null,{"$f":"LARGE(G22:G25,2)","v":0}]
[null,null,null,"Sølv",null,null,2200]
[null,null,null,"Guld",null,null,3000]

{"sheet":"P16_Resultater","index":14,"n_rows":28,"n_cols":13,"rows_kept":28,"cut":false,"hidden":false,"merged":[[2,4,2,6],[7,10,7,11],[8,10,8,11],[10,10,11,10]]}
[]
[]
[null,null,null,"Køn","Alder"]
[null,null,null,"P",16,null,"år",null,{"$f":"CONCATENATE(\"DAF_\",D4,E4)","v":"DAF_P16"}]
[null,null,null,null,"Res.",null,"Point"]
[null,null,null,"100m",null,null,{"$f":"IF(OR(ISBLANK(E6),E6>VLOOKUP($D6,INDIRECT($I$4),6,FALSE)),0,INT(VLOOKUP($D6,INDIRECT($I$4),2,FALSE)+VLOOKUP($D6,INDIRECT($I$4),3,FALSE)*I6+VLOOKUP($D6,INDIRECT($I$4),4,FALSE)*I6*I6))","v":0},null,{"$f":"IF(F6=\"[Man]\",ROUND(E6,1)+VLOOKUP($D6,INDIRECT($I$4),5,FALSE)/100,E6)","v":0},null,null,null,{"$f":"VLOOKUP($D6,INDIRECT($I$4),7,FALSE)","v":11.35}]
[null,null,null,"200m",null,null,{"$f":"IF(OR(ISBLANK(E7),E7>VLOOKUP($D7,INDIRECT($I$4),6,FALSE)),0,INT(VLOOKUP($D7,INDIRECT($I$4),2,FALSE)+VLOOKUP($D7,INDIRECT($I$4),3,FALSE)*I7+VLOOKUP($D7,INDIRECT($I$4),4,FALSE)*I7*I7))","v":0},null,{"$f":"IF(F7=\"[Man]\",ROUND(E7,1)+VLOOKUP($D7,INDIRECT($I$4),5,FALSE)/100,E7)","v":0},null,null,null,{"$f":"VLOOKUP($D7,INDIRECT($I$4),7,FALSE)","v":22.66}]
[null,null,null,"400m",null,null,0,null,{"$f":"IF(F8=\"[Man]\",ROUND(E8,1)+VLOOKUP($D8,INDIRECT($I$4),5,FALSE)/100,E8)","v":0},"Navn:",null,null,51.44]
[null,null,null,"800m",null,null,{"$f":"IF(OR(ISBLANK(E9), E9>VLOOKUP($D9,INDIRECT($I$4),6,FALSE)),0,INT(VLOOKUP($D9,INDIRECT($I$4),2,FALSE)+VLOOKUP($D9,INDIRECT($I$4),3,FALSE)*E9*86400+VLOOKUP($D9,INDIRECT($I$4),4,FALSE)*E9*86400*E9*86400))","v":0},null,null,"Klub:",{"$f":"IF(Info!D29=0,\" \",Info!D29)","v":"Vejle IF"},null,"00:02:01.930"]
[null,null,null,"1000m",null,null,{"$f":"IF(OR(ISBLANK(E10), E10>VLOOKUP($D10,INDIRECT($I$4),6,FALSE)),0,INT(VLOOKUP($D10,INDIRECT($I$4),2,FALSE)+VLOOKUP($D10,INDIRECT($I$4),3,FALSE)*E10*86400+VLOOKUP($D10,INDIRECT($I$4),4,FALSE)*E10*86400*E10*86400))","v":0},null,null,"(klub indtastes i Info skemaet)",null,null,"00:02:37.930"]
[null,null,null,"1500m",null,null,{"$f":"IF(OR(ISBLANK(E11), E11>VLOOKUP($D11,INDIRECT($I$4),6,FALSE)),0,INT(VLOOKUP($D11,INDIRECT($I$4),2,FALSE)+VLOOKUP($D11,INDIRECT($I$4),3,FALSE)*E11*86400+VLOOKUP($D11,INDIRECT($I$4),4,FALSE)*E11*86400*E11*86400))","v":0},null,null,null,{"$f":"Info!G28","v":"På   diplom"},null,"00:04:09.840"]
[null,null,null,"3000m",null,null,{"$f":"IF(OR(ISBLANK(E12), E12>VLOOKUP($D12,INDIRECT($I$4),6,FALSE)),0,INT(VLOOKUP($D12,INDIRECT($I$4),2,FALSE)+VLOOKUP($D12,INDIRECT($I$4),3,FALSE)*E12*86400+VLOOKUP($D12,INDIRECT($I$4),4,FALSE)*E12*86400*E12*86400))","v":0},null,null,null,null,null,"00:08:54.750"]
[null,null,null,"60mH",null,null,{"$f":"IF(OR(ISBLANK(E13),E13>VLOOKUP($D13,INDIRECT($I$4),6,FALSE)),0,INT(VLOOKUP($D13,INDIRECT($I$4),2,FALSE)+VLOOKUP($D13,INDIRECT($I$4),3,FALSE)*I13+VLOOKUP($D13,INDIRECT($I$4),4,FALSE)*I13*I13))","v":0},null,{"$f":"IF(F13=\"[Man]\",ROUND(E13,1)+VLOOKUP($D13,INDIRECT($I$4),5,FALSE)/100,E13)","v":0},null,null,null,7.87]
[null,null,null,"100mH",null,null,{"$f":"IF(OR(ISBLANK(E14),E14>VLOOKUP($D14,INDIRECT($I$4),6,FALSE)),0,INT(VLOOKUP($D14,INDIRECT($I$4),2,FALSE)+VLOOKUP($D14,INDIRECT($I$4),3,FALSE)*I14+VLOOKUP($D14,INDIRECT($I$4),4,FALSE)*I14*I14))","v":0},null,{"$f":"IF(F14=\"[Man]\",ROUND(E14,1)+VLOOKUP($D14,INDIRECT($I$4),5,FALSE)/100,E14)","v":0},null,null,null,12.96]
[null,null,null,"4x100m",null,null,0,null,{"$f":"IF(F15=\"[Man]\",ROUND(E15,1)+VLOOKUP($D15,INDIRECT($I$4),5,FALSE)/100,E15)","v":0},null,null,null,45.09]
[null,null,null,"højde",null,null,{"$f":"IF(OR(ISBLANK(E16), E16<VLOOKUP($D16,INDIRECT($I$4),6,FALSE)),0,INT(VLOOKUP($D16,INDIRECT($I$4),2,FALSE)+VLOOKUP($D16,INDIRECT($I$4),3,FALSE)*E16+VLOOKUP($D16,INDIRECT($I$4),4,FALSE)*E16*E16))","v":0},null,null,null,null,null,1.89]
[null,null,null,"længde",null,null,{"$f":"IF(OR(ISBLANK(E17), E17<VLOOKUP($D17,INDIRECT($I$4),6,FALSE)),0,INT(VLOOKUP($D17,INDIRECT($I$4),2,FALSE)+VLOOKUP($D17,INDIRECT($I$4),3,FALSE)*E17+VLOOKUP($D17,INDIRECT($I$4),4,FALSE)*E17*E17))","v":0},null,null,null,null,null,6.48]
[null,null,null,"stang",null,null,{"$f":"IF(OR(ISBLANK(E18), E18<VLOOKUP($D18,INDIRECT($I$4),6,FALSE)),0,INT(VLOOKUP($D18,INDIRECT($I$4),2,FALSE)+VLOOKUP($D18,INDIRECT($I$4),3,FALSE)*E18+VLOOKUP($D18,INDIRECT($I$4),4,FALSE)*E18*E18))","v":0},null,null,null,null,null,3.78]
[null,null,null,"trespring",null,null,{"$f":"IF(OR(ISBLANK(E19), E19<VLOOKUP($D19,INDIRECT($I$4),6,FALSE)),0,INT(VLOOKUP($D19,INDIRECT($I$4),2,FALSE)+VLOOKUP($D19,INDIRECT($I$4),3,FALSE)*E19+VLOOKUP($D19,INDIRECT($I$4),4,FALSE)*E19*E19))","v":0},null,null,null,null,null,12.98]
[null,null,null,"kugle",null,null,0,null,null,null,null,null,15.39]
[null,null,null,"diskos",null,null,{"$f":"IF(OR(ISBLANK(E21), E21<VLOOKUP($D21,INDIRECT($I$4),6,FALSE)),0,INT(VLOOKUP($D21,INDIRECT($I$4),2,FALSE)+VLOOKUP($D21,INDIRECT($I$4),3,FALSE)*E21+VLOOKUP($D21,INDIRECT($I$4),4,FALSE)*E21*E21))","v":0},null,null,null,null,null,56.49]
[null,null,null,"hammer",null,null,0,null,null,null,null,null,52.11]
[null,null,null,"spyd",null,null,0,null,null,null,null,null,65.98]
[null,null,null,"Point",null,null,{"$f":"LARGE(G6:G23,1)+LARGE(G6:G23,2)+LARGE(G6:G23,3)","v":0}]
[null,null,null,"Mærke",null,null,{"$f":"IF(G24>=G28,D28,IF(G24>=G27,D27,IF(G24>=G26,D26,\"ingen\")))","v":"ingen"}]
[null,null,null,"Bronze",null,null,825]
[null,null,null,"Sølv",null,null,1725]
[null,null,null,"Guld",null,null,2325]

{"sheet":"D16_Resultater","index":15,"n_rows":29,"n_cols":13,"rows_kept":29,"cut":false,"hidden":false,"merged":[[2,4,2,6],[7,10,7,11],[8,10,8,11],[10,10,11,10]]}
[]
[]
[null,null,null,"Køn","Alder"]
[null,null,null,"D",16,null,"år",null,{"$f":"CONCATENATE(\"DAF_\",D4,E4)","v":"DAF_D16"}]
[null,null,null,null,"Res.",null,"Point"]
[null,null,null,"100m",null,null,{"$f":"IF(OR(ISBLANK(E6),E6>VLOOKUP($D6,INDIRECT($I$4),6,FALSE)),0,INT(VLOOKUP($D6,INDIRECT($I$4),2,FALSE)+VLOOKUP($D6,INDIRECT($I$4),3,FALSE)*I6+VLOOKUP($D6,INDIRECT($I$4),4,FALSE)*I6*I6))","v":0},null,{"$f":"IF(F6=\"[Man]\",ROUND(E6,1)+VLOOKUP($D6,INDIRECT($I$4),5,FALSE)/100,E6)","v":0},null,null,null,{"$f":"VLOOKUP($D6,INDIRECT($I$4),7,FALSE)","v":10.39}]
[null,null,null,"200m",null,null,{"$f":"IF(OR(ISBLANK(E7),E7>VLOOKUP($D7,INDIRECT($I$4),6,FALSE)),0,INT(VLOOKUP($D7,INDIRECT($I$4),2,FALSE)+VLOOKUP($D7,INDIRECT($I$4),3,FALSE)*I7+VLOOKUP($D7,INDIRECT($I$4),4,FALSE)*I7*I7))","v":0},null,{"$f":"IF(F7=\"[Man]\",ROUND(E7,1)+VLOOKUP($D7,INDIRECT($I$4),5,FALSE)/100,E7)","v":0},null,null,null,{"$f":"VLOOKUP($D7,INDIRECT($I$4),7,FALSE)","v":20.83}]
[null,null,null,"400m",null,null,0,null,{"$f":"IF(F8=\"[Man]\",ROUND(E8,1)+VLOOKUP($D8,INDIRECT($I$4),5,FALSE)/100,E8)","v":0},"Navn:",null,null,46.48]
[null,null,null,"800m",null,null,{"$f":"IF(OR(ISBLANK(E9), E9>VLOOKUP($D9,INDIRECT($I$4),6,FALSE)),0,INT(VLOOKUP($D9,INDIRECT($I$4),2,FALSE)+VLOOKUP($D9,INDIRECT($I$4),3,FALSE)*E9*86400+VLOOKUP($D9,INDIRECT($I$4),4,FALSE)*E9*86400*E9*86400))","v":0},null,null,"Klub:",{"$f":"IF(Info!D29=0,\" \",Info!D29)","v":"Vejle IF"},null,"00:01:48.970"]
[null,null,null,"1000m",null,null,{"$f":"IF(OR(ISBLANK(E10), E10>VLOOKUP($D10,INDIRECT($I$4),6,FALSE)),0,INT(VLOOKUP($D10,INDIRECT($I$4),2,FALSE)+VLOOKUP($D10,INDIRECT($I$4),3,FALSE)*E10*86400+VLOOKUP($D10,INDIRECT($I$4),4,FALSE)*E10*86400*E10*86400))","v":0},null,null,"(klub indtastes i Info skemaet)",null,null,"00:02:20.680"]
[null,null,null,"1500m",null,null,0,null,null,null,{"$f":"Info!G28","v":"På   diplom"},null,"00:03:43.940"]
[null,null,null,"3000m",null,null,0,null,null,null,null,null,"00:08:04.950"]
[null,null,null,"60mH",null,null,{"$f":"IF(OR(ISBLANK(E13),E13>VLOOKUP($D13,INDIRECT($I$4),6,FALSE)),0,INT(VLOOKUP($D13,INDIRECT($I$4),2,FALSE)+VLOOKUP($D13,INDIRECT($I$4),3,FALSE)*I13+VLOOKUP($D13,INDIRECT($I$4),4,FALSE)*I13*I13))","v":0},null,{"$f":"IF(F13=\"[Man]\",ROUND(E13,1)+VLOOKUP($D13,INDIRECT($I$4),5,FALSE)/100,E13)","v":0},null,null,null,7.58]
[null,null,null,"110mH",null,null,{"$f":"IF(OR(ISBLANK(E14),E14>VLOOKUP($D14,INDIRECT($I$4),6,FALSE)),0,INT(VLOOKUP($D14,INDIRECT($I$4),2,FALSE)+VLOOKUP($D14,INDIRECT($I$4),3,FALSE)*I14+VLOOKUP($D14,INDIRECT($I$4),4,FALSE)*I14*I14))","v":0},null,{"$f":"IF(F14=\"[Man]\",ROUND(E14,1)+VLOOKUP($D14,INDIRECT($I$4),5,FALSE)/100,E14)","v":0},null,null,null,13.67]
[null,null,null,"4x100m",null,null,0,null,{"$f":"IF(F15=\"[Man]\",ROUND(E15,1)+VLOOKUP($D15,INDIRECT($I$4),5,FALSE)/100,E15)","v":0},null,null,null,41.06]
[null,null,null,"højde",null,null,{"$f":"IF(OR(ISBLANK(E16), E16<VLOOKUP($D16,INDIRECT($I$4),6,FALSE)),0,INT(VLOOKUP($D16,INDIRECT($I$4),2,FALSE)+VLOOKUP($D16,INDIRECT($I$4),3,FALSE)*E16+VLOOKUP($D16,INDIRECT($I$4),4,FALSE)*E16*E16))","v":0},null,null,null,null,null,2.2599999999999998]
[null,null,null,"længde",null,null,{"$f":"IF(OR(ISBLANK(E17), E17<VLOOKUP($D17,INDIRECT($I$4),6,FALSE)),0,INT(VLOOKUP($D17,INDIRECT($I$4),2,FALSE)+VLOOKUP($D17,INDIRECT($I$4),3,FALSE)*E17+VLOOKUP($D17,INDIRECT($I$4),4,FALSE)*E17*E17))","v":0},null,null,null,null,null,7.8]
[null,null,null,"stang",null,null,{"$f":"IF(OR(ISBLANK(E18), E18<VLOOKUP($D18,INDIRECT($I$4),6,FALSE)),0,INT(VLOOKUP($D18,INDIRECT($I$4),2,FALSE)+VLOOKUP($D18,INDIRECT($I$4),3,FALSE)*E18+VLOOKUP($D18,INDIRECT($I$4),4,FALSE)*E18*E18))","v":0},null,null,null,null,null,5.36]
[null,null,null,"trespring",null,null,0,null,null,null,null,null,15.97]
[null,null,null,"kugle",null,null,{"$f":"IF(OR(ISBLANK(E20), E20<VLOOKUP($D20,INDIRECT($I$4),6,FALSE)),0,INT(VLOOKUP($D20,INDIRECT($I$4),2,FALSE)+VLOOKUP($D20,INDIRECT($I$4),3,FALSE)*E20+VLOOKUP($D20,INDIRECT($I$4),4,FALSE)*E20*E20))","v":0},null,null,null,null,null,20.66]
[null,null,null,"diskos",null,null,{"$f":"IF(OR(ISBLANK(E21), E21<VLOOKUP($D21,INDIRECT($I$4),6,FALSE)),0,INT(VLOOKUP($D21,INDIRECT($I$4),2,FALSE)+VLOOKUP($D21,INDIRECT($I$4),3,FALSE)*E21+VLOOKUP($D21,INDIRECT($I$4),4,FALSE)*E21*E21))","v":0},null,null,null,null,null,68.03]
[null,null,null,"hammer",null,null,{"$f":"IF(OR(ISBLANK(E22), E22<VLOOKUP($D22,INDIRECT($I$4),6,FALSE)),0,INT(VLOOKUP($D22,INDIRECT($I$4),2,FALSE)+VLOOKUP($D22,INDIRECT($I$4),3,FALSE)*E22+VLOOKUP($D22,INDIRECT($I$4),4,FALSE)*E22*E22))","v":0},null,null,null,null,null,77.55]
[null,null,null,"spyd",null,null,0,null,null,null,null,null,77.27]
[null,null,null,"vægt",null,null,0,null,null,null,null,null,20.66]
[null,null,null,"Point",null,null,{"$f":"LARGE(G6:G24,1)+LARGE(G6:G24,2)+LARGE(G6:G24,3)","v":0}]
[null,null,null,"Mærke",null,null,{"$f":"IF(G25>=G29,D29,IF(G25>=G28,D28,IF(G25>=G27,D27,\"ingen\")))","v":"ingen"}]
[null,null,null,"Bronze",null,null,825]
[null,null,null,"Sølv",null,null,1725]
[null,null,null,"Guld",null,null,2325]

{"sheet":"P17_Resultater","index":16,"n_rows":28,"n_cols":13,"rows_kept":28,"cut":false,"hidden":false,"merged":[[2,4,2,6],[7,10,7,11],[8,10,8,11],[10,10,11,10]]}
[]
[]
[null,null,null,"Køn","Alder"]
[null,null,null,"P",17,null,"år",null,{"$f":"CONCATENATE(\"DAF_\",D4,E4)","v":"DAF_P17"}]
[null,null,null,null,"Res.",null,"Point"]
[null,null,null,"100m",null,null,{"$f":"IF(OR(ISBLANK(E6),E6>VLOOKUP($D6,INDIRECT($I$4),6,FALSE)),0,INT(VLOOKUP($D6,INDIRECT($I$4),2,FALSE)+VLOOKUP($D6,INDIRECT($I$4),3,FALSE)*I6+VLOOKUP($D6,INDIRECT($I$4),4,FALSE)*I6*I6))","v":0},null,{"$f":"IF(F6=\"[Man]\",ROUND(E6,1)+VLOOKUP($D6,INDIRECT($I$4),5,FALSE)/100,E6)","v":0},null,null,null,{"$f":"VLOOKUP($D6,INDIRECT($I$4),7,FALSE)","v":11.35}]
[null,null,null,"200m",null,null,{"$f":"IF(OR(ISBLANK(E7),E7>VLOOKUP($D7,INDIRECT($I$4),6,FALSE)),0,INT(VLOOKUP($D7,INDIRECT($I$4),2,FALSE)+VLOOKUP($D7,INDIRECT($I$4),3,FALSE)*I7+VLOOKUP($D7,INDIRECT($I$4),4,FALSE)*I7*I7))","v":0},null,{"$f":"IF(F7=\"[Man]\",ROUND(E7,1)+VLOOKUP($D7,INDIRECT($I$4),5,FALSE)/100,E7)","v":0},null,null,null,{"$f":"VLOOKUP($D7,INDIRECT($I$4),7,FALSE)","v":22.66}]
[null,null,null,"400m",null,null,0,null,{"$f":"IF(F8=\"[Man]\",ROUND(E8,1)+VLOOKUP($D8,INDIRECT($I$4),5,FALSE)/100,E8)","v":0},"Navn:","Esben Poulsen",null,51.44]
[null,null,null,"800m",null,null,{"$f":"IF(OR(ISBLANK(E9), E9>VLOOKUP($D9,INDIRECT($I$4),6,FALSE)),0,INT(VLOOKUP($D9,INDIRECT($I$4),2,FALSE)+VLOOKUP($D9,INDIRECT($I$4),3,FALSE)*E9*86400+VLOOKUP($D9,INDIRECT($I$4),4,FALSE)*E9*86400*E9*86400))","v":0},null,null,"Klub:",{"$f":"IF(Info!D29=0,\" \",Info!D29)","v":"Vejle IF"},null,"00:02:01.930"]
[null,null,null,"1000m",null,null,{"$f":"IF(OR(ISBLANK(E10), E10>VLOOKUP($D10,INDIRECT($I$4),6,FALSE)),0,INT(VLOOKUP($D10,INDIRECT($I$4),2,FALSE)+VLOOKUP($D10,INDIRECT($I$4),3,FALSE)*E10*86400+VLOOKUP($D10,INDIRECT($I$4),4,FALSE)*E10*86400*E10*86400))","v":0},null,null,"(klub indtastes i Info skemaet)",null,null,"00:02:37.930"]
[null,null,null,"1500m",null,null,{"$f":"IF(OR(ISBLANK(E11), E11>VLOOKUP($D11,INDIRECT($I$4),6,FALSE)),0,INT(VLOOKUP($D11,INDIRECT($I$4),2,FALSE)+VLOOKUP($D11,INDIRECT($I$4),3,FALSE)*E11*86400+VLOOKUP($D11,INDIRECT($I$4),4,FALSE)*E11*86400*E11*86400))","v":0},null,null,null,{"$f":"Info!G28","v":"På   diplom"},null,"00:04:09.840"]
[null,null,null,"3000m",null,null,{"$f":"IF(OR(ISBLANK(E12), E12>VLOOKUP($D12,INDIRECT($I$4),6,FALSE)),0,INT(VLOOKUP($D12,INDIRECT($I$4),2,FALSE)+VLOOKUP($D12,INDIRECT($I$4),3,FALSE)*E12*86400+VLOOKUP($D12,INDIRECT($I$4),4,FALSE)*E12*86400*E12*86400))","v":0},null,null,null,null,null,"00:08:54.750"]
[null,null,null,"60mH",null,null,{"$f":"IF(OR(ISBLANK(E13),E13>VLOOKUP($D13,INDIRECT($I$4),6,FALSE)),0,INT(VLOOKUP($D13,INDIRECT($I$4),2,FALSE)+VLOOKUP($D13,INDIRECT($I$4),3,FALSE)*I13+VLOOKUP($D13,INDIRECT($I$4),4,FALSE)*I13*I13))","v":0},null,{"$f":"IF(F13=\"[Man]\",ROUND(E13,1)+VLOOKUP($D13,INDIRECT($I$4),5,FALSE)/100,E13)","v":0},null,null,null,7.87]
[null,null,null,"100mH",null,null,{"$f":"IF(OR(ISBLANK(E14),E14>VLOOKUP($D14,INDIRECT($I$4),6,FALSE)),0,INT(VLOOKUP($D14,INDIRECT($I$4),2,FALSE)+VLOOKUP($D14,INDIRECT($I$4),3,FALSE)*I14+VLOOKUP($D14,INDIRECT($I$4),4,FALSE)*I14*I14))","v":0},null,{"$f":"IF(F14=\"[Man]\",ROUND(E14,1)+VLOOKUP($D14,INDIRECT($I$4),5,FALSE)/100,E14)","v":0},null,null,null,12.96]
[null,null,null,"4x100m",null,null,0,null,{"$f":"IF(F15=\"[Man]\",ROUND(E15,1)+VLOOKUP($D15,INDIRECT($I$4),5,FALSE)/100,E15)","v":0},null,null,null,45.09]
[null,null,null,"højde",null,null,{"$f":"IF(OR(ISBLANK(E16), E16<VLOOKUP($D16,INDIRECT($I$4),6,FALSE)),0,INT(VLOOKUP($D16,INDIRECT($I$4),2,FALSE)+VLOOKUP($D16,INDIRECT($I$4),3,FALSE)*E16+VLOOKUP($D16,INDIRECT($I$4),4,FALSE)*E16*E16))","v":0},null,null,null,null,null,1.89]
[null,null,null,"længde",null,null,0,null,null,null,null,null,6.48]
[null,null,null,"stang",null,null,{"$f":"IF(OR(ISBLANK(E18), E18<VLOOKUP($D18,INDIRECT($I$4),6,FALSE)),0,INT(VLOOKUP($D18,INDIRECT($I$4),2,FALSE)+VLOOKUP($D18,INDIRECT($I$4),3,FALSE)*E18+VLOOKUP($D18,INDIRECT($I$4),4,FALSE)*E18*E18))","v":0},null,null,null,null,null,3.78]
[null,null,null,"trespring",null,null,{"$f":"IF(OR(ISBLANK(E19), E19<VLOOKUP($D19,INDIRECT($I$4),6,FALSE)),0,INT(VLOOKUP($D19,INDIRECT($I$4),2,FALSE)+VLOOKUP($D19,INDIRECT($I$4),3,FALSE)*E19+VLOOKUP($D19,INDIRECT($I$4),4,FALSE)*E19*E19))","v":0},null,null,null,null,null,12.98]
[null,null,null,"kugle",null,null,0,null,null,null,null,null,15.39]
[null,null,null,"diskos",null,null,0,null,null,null,null,null,56.49]
[null,null,null,"hammer",null,null,0,null,null,null,null,null,52.11]
[null,null,null,"spyd",null,null,0,null,null,null,null,null,65.98]
[null,null,null,"Point",null,null,{"$f":"LARGE(G6:G23,1)+LARGE(G6:G23,2)+LARGE(G6:G23,3)","v":0}]
[null,null,null,"Mærke",null,null,{"$f":"IF(G24>=G28,D28,IF(G24>=G27,D27,IF(G24>=G26,D26,\"ingen\")))","v":"ingen"}]
[null,null,null,"Bronze",null,null,825]
[null,null,null,"Sølv",null,null,1800]
[null,null,null,"Guld",null,null,2400]

{"sheet":"D17_Resultater","index":17,"n_rows":29,"n_cols":13,"rows_kept":29,"cut":false,"hidden":false,"merged":[[2,4,2,6],[7,10,7,11],[8,10,8,11],[10,10,11,10]]}
[]
[]
[null,null,null,"Køn","Alder"]
[null,null,null,"D",17,null,"år",null,{"$f":"CONCATENATE(\"DAF_\",D4,E4)","v":"DAF_D17"}]
[null,null,null,null,"Res.",null,"Point"]
[null,null,null,"100m",null,null,{"$f":"IF(OR(ISBLANK(E6),E6>VLOOKUP($D6,INDIRECT($I$4),6,FALSE)),0,INT(VLOOKUP($D6,INDIRECT($I$4),2,FALSE)+VLOOKUP($D6,INDIRECT($I$4),3,FALSE)*I6+VLOOKUP($D6,INDIRECT($I$4),4,FALSE)*I6*I6))","v":0},null,{"$f":"IF(F6=\"[Man]\",ROUND(E6,1)+VLOOKUP($D6,INDIRECT($I$4),5,FALSE)/100,E6)","v":0},null,null,null,{"$f":"VLOOKUP($D6,INDIRECT($I$4),7,FALSE)","v":10.39}]
[null,null,null,"200m",null,null,{"$f":"IF(OR(ISBLANK(E7),E7>VLOOKUP($D7,INDIRECT($I$4),6,FALSE)),0,INT(VLOOKUP($D7,INDIRECT($I$4),2,FALSE)+VLOOKUP($D7,INDIRECT($I$4),3,FALSE)*I7+VLOOKUP($D7,INDIRECT($I$4),4,FALSE)*I7*I7))","v":0},null,{"$f":"IF(F7=\"[Man]\",ROUND(E7,1)+VLOOKUP($D7,INDIRECT($I$4),5,FALSE)/100,E7)","v":0},null,null,null,{"$f":"VLOOKUP($D7,INDIRECT($I$4),7,FALSE)","v":20.83}]
[null,null,null,"400m",null,null,0,null,{"$f":"IF(F8=\"[Man]\",ROUND(E8,1)+VLOOKUP($D8,INDIRECT($I$4),5,FALSE)/100,E8)","v":0},"Navn:",null,null,46.48]
[null,null,null,"800m",null,null,{"$f":"IF(OR(ISBLANK(E9), E9>VLOOKUP($D9,INDIRECT($I$4),6,FALSE)),0,INT(VLOOKUP($D9,INDIRECT($I$4),2,FALSE)+VLOOKUP($D9,INDIRECT($I$4),3,FALSE)*E9*86400+VLOOKUP($D9,INDIRECT($I$4),4,FALSE)*E9*86400*E9*86400))","v":0},null,null,"Klub:",{"$f":"IF(Info!D29=0,\" \",Info!D29)","v":"Vejle IF"},null,"00:01:48.970"]
[null,null,null,"1000m",null,null,{"$f":"IF(OR(ISBLANK(E10), E10>VLOOKUP($D10,INDIRECT($I$4),6,FALSE)),0,INT(VLOOKUP($D10,INDIRECT($I$4),2,FALSE)+VLOOKUP($D10,INDIRECT($I$4),3,FALSE)*E10*86400+VLOOKUP($D10,INDIRECT($I$4),4,FALSE)*E10*86400*E10*86400))","v":0},null,null,"(klub indtastes i Info skemaet)",null,null,"00:02:20.680"]
[null,null,null,"1500m",null,null,0,null,null,null,{"$f":"Info!G28","v":"På   diplom"},null,"00:03:43.940"]
[null,null,null,"3000m",null,null,0,null,null,null,null,null,"00:08:04.950"]
[null,null,null,"60mH",null,null,{"$f":"IF(OR(ISBLANK(E13),E13>VLOOKUP($D13,INDIRECT($I$4),6,FALSE)),0,INT(VLOOKUP($D13,INDIRECT($I$4),2,FALSE)+VLOOKUP($D13,INDIRECT($I$4),3,FALSE)*I13+VLOOKUP($D13,INDIRECT($I$4),4,FALSE)*I13*I13))","v":0},null,{"$f":"IF(F13=\"[Man]\",ROUND(E13,1)+VLOOKUP($D13,INDIRECT($I$4),5,FALSE)/100,E13)","v":0},null,null,null,7.58]
[null,null,null,"110mH",null,null,{"$f":"IF(OR(ISBLANK(E14),E14>VLOOKUP($D14,INDIRECT($I$4),6,FALSE)),0,INT(VLOOKUP($D14,INDIRECT($I$4),2,FALSE)+VLOOKUP($D14,INDIRECT($I$4),3,FALSE)*I14+VLOOKUP($D14,INDIRECT($I$4),4,FALSE)*I14*I14))","v":0},null,{"$f":"IF(F14=\"[Man]\",ROUND(E14,1)+VLOOKUP($D14,INDIRECT($I$4),5,FALSE)/100,E14)","v":0},null,null,null,13.67]
[null,null,null,"4x100m",null,null,0,null,{"$f":"IF(F15=\"[Man]\",ROUND(E15,1)+VLOOKUP($D15,INDIRECT($I$4),5,FALSE)/100,E15)","v":0},null,null,null,41.06]
[null,null,null,"højde",null,null,{"$f":"IF(OR(ISBLANK(E16), E16<VLOOKUP($D16,INDIRECT($I$4),6,FALSE)),0,INT(VLOOKUP($D16,INDIRECT($I$4),2,FALSE)+VLOOKUP($D16,INDIRECT($I$4),3,FALSE)*E16+VLOOKUP($D16,INDIRECT($I$4),4,FALSE)*E16*E16))","v":0},null,null,null,null,null,2.2599999999999998]
[null,null,null,"længde",null,null,{"$f":"IF(OR(ISBLANK(E17), E17<VLOOKUP($D17,INDIRECT($I$4),6,FALSE)),0,INT(VLOOKUP($D17,INDIRECT($I$4),2,FALSE)+VLOOKUP($D17,INDIRECT($I$4),3,FALSE)*E17+VLOOKUP($D17,INDIRECT($I$4),4,FALSE)*E17*E17))","v":0},null,null,null,null,null,7.8]
[null,null,null,"stang",null,null,{"$f":"IF(OR(ISBLANK(E18), E18<VLOOKUP($D18,INDIRECT($I$4),6,FALSE)),0,INT(VLOOKUP($D18,INDIRECT($I$4),2,FALSE)+VLOOKUP($D18,INDIRECT($I$4),3,FALSE)*E18+VLOOKUP($D18,INDIRECT($I$4),4,FALSE)*E18*E18))","v":0},null,null,null,null,null,5.36]
[null,null,null,"trespring",null,null,0,null,null,null,null,null,15.97]
[null,null,null,"kugle",null,null,{"$f":"IF(OR(ISBLANK(E20), E20<VLOOKUP($D20,INDIRECT($I$4),6,FALSE)),0,INT(VLOOKUP($D20,INDIRECT($I$4),2,FALSE)+VLOOKUP($D20,INDIRECT($I$4),3,FALSE)*E20+VLOOKUP($D20,INDIRECT($I$4),4,FALSE)*E20*E20))","v":0},null,null,null,null,null,20.66]
[null,null,null,"diskos",null,null,{"$f":"IF(OR(ISBLANK(E21), E21<VLOOKUP($D21,INDIRECT($I$4),6,FALSE)),0,INT(VLOOKUP($D21,INDIRECT($I$4),2,FALSE)+VLOOKUP($D21,INDIRECT($I$4),3,FALSE)*E21+VLOOKUP($D21,INDIRECT($I$4),4,FALSE)*E21*E21))","v":0},null,null,null,null,null,68.03]
[null,null,null,"hammer",null,null,{"$f":"IF(OR(ISBLANK(E22), E22<VLOOKUP($D22,INDIRECT($I$4),6,FALSE)),0,INT(VLOOKUP($D22,INDIRECT($I$4),2,FALSE)+VLOOKUP($D22,INDIRECT($I$4),3,FALSE)*E22+VLOOKUP($D22,INDIRECT($I$4),4,FALSE)*E22*E22))","v":0},null,null,null,null,null,77.55]
[null,null,null,"spyd",null,null,0,null,null,null,null,null,77.27]
[null,null,null,"vægt",null,null,0,null,null,null,null,null,20.66]
[null,null,null,"Point",null,null,{"$f":"LARGE(G6:G24,1)+LARGE(G6:G24,2)+LARGE(G6:G24,3)","v":0}]
[null,null,null,"Mærke",null,null,{"$f":"IF(G25>=G29,D29,IF(G25>=G28,D28,IF(G25>=G27,D27,\"ingen\")))","v":"ingen"}]
[null,null,null,"Bronze",null,null,825]
[null,null,null,"Sølv",null,null,1800]
[null,null,null,"Guld",null,null,2400]

{"sheet":"P18_Resultater","index":18,"n_rows":28,"n_cols":13,"rows_kept":28,"cut":false,"hidden":false,"merged":[[2,4,2,6],[7,10,7,11],[8,10,8,11],[10,10,11,10]]}
[]
[]
[null,null,null,"Køn","Alder"]
[null,null,null,"P",18,null,"år",null,{"$f":"CONCATENATE(\"DAF_\",D4,E4)","v":"DAF_P18"}]
[null,null,null,null,"Res.",null,"Point"]
[null,null,null,"100m",null,null,{"$f":"IF(OR(ISBLANK(E6),E6>VLOOKUP($D6,INDIRECT($I$4),6,FALSE)),0,INT(VLOOKUP($D6,INDIRECT($I$4),2,FALSE)+VLOOKUP($D6,INDIRECT($I$4),3,FALSE)*I6+VLOOKUP($D6,INDIRECT($I$4),4,FALSE)*I6*I6))","v":0},null,{"$f":"IF(F6=\"[Man]\",ROUND(E6,1)+VLOOKUP($D6,INDIRECT($I$4),5,FALSE)/100,E6)","v":0},null,null,null,{"$f":"VLOOKUP($D6,INDIRECT($I$4),7,FALSE)","v":11.35}]
[null,null,null,"200m",null,null,{"$f":"IF(OR(ISBLANK(E7),E7>VLOOKUP($D7,INDIRECT($I$4),6,FALSE)),0,INT(VLOOKUP($D7,INDIRECT($I$4),2,FALSE)+VLOOKUP($D7,INDIRECT($I$4),3,FALSE)*I7+VLOOKUP($D7,INDIRECT($I$4),4,FALSE)*I7*I7))","v":0},null,{"$f":"IF(F7=\"[Man]\",ROUND(E7,1)+VLOOKUP($D7,INDIRECT($I$4),5,FALSE)/100,E7)","v":0},null,null,null,{"$f":"VLOOKUP($D7,INDIRECT($I$4),7,FALSE)","v":22.66}]
[null,null,null,"400m",null,null,0,null,{"$f":"IF(F8=\"[Man]\",ROUND(E8,1)+VLOOKUP($D8,INDIRECT($I$4),5,FALSE)/100,E8)","v":0},"Navn:",null,null,51.44]
[null,null,null,"800m",null,null,{"$f":"IF(OR(ISBLANK(E9), E9>VLOOKUP($D9,INDIRECT($I$4),6,FALSE)),0,INT(VLOOKUP($D9,INDIRECT($I$4),2,FALSE)+VLOOKUP($D9,INDIRECT($I$4),3,FALSE)*E9*86400+VLOOKUP($D9,INDIRECT($I$4),4,FALSE)*E9*86400*E9*86400))","v":0},null,null,"Klub:",{"$f":"IF(Info!D29=0,\" \",Info!D29)","v":"Vejle IF"},null,"00:02:01.930"]
[null,null,null,"1000m",null,null,{"$f":"IF(OR(ISBLANK(E10), E10>VLOOKUP($D10,INDIRECT($I$4),6,FALSE)),0,INT(VLOOKUP($D10,INDIRECT($I$4),2,FALSE)+VLOOKUP($D10,INDIRECT($I$4),3,FALSE)*E10*86400+VLOOKUP($D10,INDIRECT($I$4),4,FALSE)*E10*86400*E10*86400))","v":0},null,null,"(klub indtastes i Info skemaet)",null,null,"00:02:37.930"]
[null,null,null,"1500m",null,null,{"$f":"IF(OR(ISBLANK(E11), E11>VLOOKUP($D11,INDIRECT($I$4),6,FALSE)),0,INT(VLOOKUP($D11,INDIRECT($I$4),2,FALSE)+VLOOKUP($D11,INDIRECT($I$4),3,FALSE)*E11*86400+VLOOKUP($D11,INDIRECT($I$4),4,FALSE)*E11*86400*E11*86400))","v":0},null,null,null,{"$f":"Info!G28","v":"På   diplom"},null,"00:04:09.840"]
[null,null,null,"3000m",null,null,{"$f":"IF(OR(ISBLANK(E12), E12>VLOOKUP($D12,INDIRECT($I$4),6,FALSE)),0,INT(VLOOKUP($D12,INDIRECT($I$4),2,FALSE)+VLOOKUP($D12,INDIRECT($I$4),3,FALSE)*E12*86400+VLOOKUP($D12,INDIRECT($I$4),4,FALSE)*E12*86400*E12*86400))","v":0},null,null,null,null,null,"00:08:54.750"]
[null,null,null,"60mH",null,null,{"$f":"IF(OR(ISBLANK(E13),E13>VLOOKUP($D13,INDIRECT($I$4),6,FALSE)),0,INT(VLOOKUP($D13,INDIRECT($I$4),2,FALSE)+VLOOKUP($D13,INDIRECT($I$4),3,FALSE)*I13+VLOOKUP($D13,INDIRECT($I$4),4,FALSE)*I13*I13))","v":0},null,{"$f":"IF(F13=\"[Man]\",ROUND(E13,1)+VLOOKUP($D13,INDIRECT($I$4),5,FALSE)/100,E13)","v":0},null,null,null,7.87]
[null,null,null,"100mH",null,null,{"$f":"IF(OR(ISBLANK(E14),E14>VLOOKUP($D14,INDIRECT($I$4),6,FALSE)),0,INT(VLOOKUP($D14,INDIRECT($I$4),2,FALSE)+VLOOKUP($D14,INDIRECT($I$4),3,FALSE)*I14+VLOOKUP($D14,INDIRECT($I$4),4,FALSE)*I14*I14))","v":0},null,{"$f":"IF(F14=\"[Man]\",ROUND(E14,1)+VLOOKUP($D14,INDIRECT($I$4),5,FALSE)/100,E14)","v":0},null,null,null,12.96]
[null,null,null,"4x100m",null,null,0,null,{"$f":"IF(F15=\"[Man]\",ROUND(E15,1)+VLOOKUP($D15,INDIRECT($I$4),5,FALSE)/100,E15)","v":0},null,null,null,45.09]
[null,null,null,"højde",null,null,{"$f":"IF(OR(ISBLANK(E16), E16<VLOOKUP($D16,INDIRECT($I$4),6,FALSE)),0,INT(VLOOKUP($D16,INDIRECT($I$4),2,FALSE)+VLOOKUP($D16,INDIRECT($I$4),3,FALSE)*E16+VLOOKUP($D16,INDIRECT($I$4),4,FALSE)*E16*E16))","v":0},null,null,null,null,null,1.89]
[null,null,null,"længde",null,null,0,null,null,null,null,null,6.48]
[null,null,null,"stang",null,null,{"$f":"IF(OR(ISBLANK(E18), E18<VLOOKUP($D18,INDIRECT($I$4),6,FALSE)),0,INT(VLOOKUP($D18,INDIRECT($I$4),2,FALSE)+VLOOKUP($D18,INDIRECT($I$4),3,FALSE)*E18+VLOOKUP($D18,INDIRECT($I$4),4,FALSE)*E18*E18))","v":0},null,null,null,null,null,3.78]
[null,null,null,"trespring",null,null,{"$f":"IF(OR(ISBLANK(E19), E19<VLOOKUP($D19,INDIRECT($I$4),6,FALSE)),0,INT(VLOOKUP($D19,INDIRECT($I$4),2,FALSE)+VLOOKUP($D19,INDIRECT($I$4),3,FALSE)*E19+VLOOKUP($D19,INDIRECT($I$4),4,FALSE)*E19*E19))","v":0},null,null,null,null,null,12.98]
[null,null,null,"kugle",null,null,0,null,null,null,null,null,15.39]
[null,null,null,"diskos",null,null,0,null,null,null,null,null,56.49]
[null,null,null,"hammer",null,null,0,null,null,null,null,null,52.11]
[null,null,null,"spyd",null,null,0,null,null,null,null,null,65.98]
[null,null,null,"Point",null,null,{"$f":"LARGE(G6:G23,1)+LARGE(G6:G23,2)+LARGE(G6:G23,3)","v":0}]
[null,null,null,"Mærke",null,null,{"$f":"IF(G24>=G28,D28,IF(G24>=G27,D27,IF(G24>=G26,D26,\"ingen\")))","v":"ingen"}]
[null,null,null,"Bronze",null,null,825]
[null,null,null,"Sølv",null,null,1900]
[null,null,null,"Guld",null,null,2500]

{"sheet":"D18_Resultater","index":19,"n_rows":28,"n_cols":13,"rows_kept":28,"cut":false,"hidden":false,"merged":[[2,4,2,6],[7,10,7,11],[8,10,8,11],[10,10,11,10]]}
[]
[]
[null,null,null,"Køn","Alder"]
[null,null,null,"D",18,null,"år",null,{"$f":"CONCATENATE(\"DAF_\",D4,E4)","v":"DAF_D18"}]
[null,null,null,null,"Res.",null,"Point"]
[null,null,null,"100m",null,null,{"$f":"IF(OR(ISBLANK(E6),E6>VLOOKUP($D6,INDIRECT($I$4),6,FALSE)),0,INT(VLOOKUP($D6,INDIRECT($I$4),2,FALSE)+VLOOKUP($D6,INDIRECT($I$4),3,FALSE)*I6+VLOOKUP($D6,INDIRECT($I$4),4,FALSE)*I6*I6))","v":0},null,{"$f":"IF(F6=\"[Man]\",ROUND(E6,1)+VLOOKUP($D6,INDIRECT($I$4),5,FALSE)/100,E6)","v":0},null,null,null,{"$f":"VLOOKUP($D6,INDIRECT($I$4),7,FALSE)","v":10.39}]
[null,null,null,"200m",null,null,{"$f":"IF(OR(ISBLANK(E7),E7>VLOOKUP($D7,INDIRECT($I$4),6,FALSE)),0,INT(VLOOKUP($D7,INDIRECT($I$4),2,FALSE)+VLOOKUP($D7,INDIRECT($I$4),3,FALSE)*I7+VLOOKUP($D7,INDIRECT($I$4),4,FALSE)*I7*I7))","v":0},null,{"$f":"IF(F7=\"[Man]\",ROUND(E7,1)+VLOOKUP($D7,INDIRECT($I$4),5,FALSE)/100,E7)","v":0},null,null,null,{"$f":"VLOOKUP($D7,INDIRECT($I$4),7,FALSE)","v":20.83}]
[null,null,null,"400m",null,null,0,null,{"$f":"IF(F8=\"[Man]\",ROUND(E8,1)+VLOOKUP($D8,INDIRECT($I$4),5,FALSE)/100,E8)","v":0},"Navn:",null,null,46.48]
[null,null,null,"800m",null,null,{"$f":"IF(ISBLANK(E9),0,IF(INT(VLOOKUP($D9,INDIRECT($I$4),2,FALSE)+VLOOKUP($D9,INDIRECT($I$4),3,FALSE)*E9*86400+VLOOKUP($D9,INDIRECT($I$4),4,FALSE)*E9*86400*E9*86400)<0,0,INT(VLOOKUP($D9,INDIRECT($I$4),2,FALSE)+VLOOKUP($D9,INDIRECT($I$4),3,FALSE)*E9*86400+VLOOKUP($D9,INDIRECT($I$4),4,FALSE)*E9*86400*E9*86400)))","v":0},null,null,"Klub:",{"$f":"IF(Info!D29=0,\" \",Info!D29)","v":"Vejle IF"},null,"00:01:48.970"]
[null,null,null,"1000m",null,null,{"$f":"IF(ISBLANK(E10),0,IF(INT(VLOOKUP($D10,INDIRECT($I$4),2,FALSE)+VLOOKUP($D10,INDIRECT($I$4),3,FALSE)*E10*86400+VLOOKUP($D10,INDIRECT($I$4),4,FALSE)*E10*86400*E10*86400)<0,0,INT(VLOOKUP($D10,INDIRECT($I$4),2,FALSE)+VLOOKUP($D10,INDIRECT($I$4),3,FALSE)*E10*86400+VLOOKUP($D10,INDIRECT($I$4),4,FALSE)*E10*86400*E10*86400)))","v":0},null,null,"(klub indtastes i Info skemaet)",null,null,"00:02:20.680"]
[null,null,null,"1500m",null,null,0,null,null,null,{"$f":"Info!G28","v":"På   diplom"},null,"00:03:43.940"]
[null,null,null,"3000m",null,null,0,null,null,null,null,null,"00:08:04.950"]
[null,null,null,"110mH",null,null,{"$f":"IF(OR(ISBLANK(E13),E13>VLOOKUP($D13,INDIRECT($I$4),6,FALSE)),0,INT(VLOOKUP($D13,INDIRECT($I$4),2,FALSE)+VLOOKUP($D13,INDIRECT($I$4),3,FALSE)*I13+VLOOKUP($D13,INDIRECT($I$4),4,FALSE)*I13*I13))","v":0},null,{"$f":"IF(F13=\"[Man]\",ROUND(E13,1)+VLOOKUP($D13,INDIRECT($I$4),5,FALSE)/100,E13)","v":0},null,null,null,13.67]
[null,null,null,"4x100m",null,null,0,null,{"$f":"IF(F14=\"[Man]\",ROUND(E14,1)+VLOOKUP($D14,INDIRECT($I$4),5,FALSE)/100,E14)","v":0},null,null,null,41.06]
[null,null,null,"højde",null,null,{"$f":"IF(OR(ISBLANK(E15), E15<VLOOKUP($D15,INDIRECT($I$4),6,FALSE)),0,INT(VLOOKUP($D15,INDIRECT($I$4),2,FALSE)+VLOOKUP($D15,INDIRECT($I$4),3,FALSE)*E15+VLOOKUP($D15,INDIRECT($I$4),4,FALSE)*E15*E15))","v":0},null,null,null,null,null,2.2599999999999998]
[null,null,null,"længde",null,null,0,null,null,null,null,null,7.8]
[null,null,null,"stang",null,null,{"$f":"IF(OR(ISBLANK(E17), E17<VLOOKUP($D17,INDIRECT($I$4),6,FALSE)),0,INT(VLOOKUP($D17,INDIRECT($I$4),2,FALSE)+VLOOKUP($D17,INDIRECT($I$4),3,FALSE)*E17+VLOOKUP($D17,INDIRECT($I$4),4,FALSE)*E17*E17))","v":0},null,null,null,null,null,5.36]
[null,null,null,"trespring",null,null,{"$f":"IF(OR(ISBLANK(E18), E18<VLOOKUP($D18,INDIRECT($I$4),6,FALSE)),0,INT(VLOOKUP($D18,INDIRECT($I$4),2,FALSE)+VLOOKUP($D18,INDIRECT($I$4),3,FALSE)*E18+VLOOKUP($D18,INDIRECT($I$4),4,FALSE)*E18*E18))","v":0},null,null,null,null,null,15.97]
[null,null,null,"kugle",null,null,{"$f":"IF(OR(ISBLANK(E19), E19<VLOOKUP($D19,INDIRECT($I$4),6,FALSE)),0,INT(VLOOKUP($D19,INDIRECT($I$4),2,FALSE)+VLOOKUP($D19,INDIRECT($I$4),3,FALSE)*E19+VLOOKUP($D19,INDIRECT($I$4),4,FALSE)*E19*E19))","v":0},null,null,null,null,null,20.66]
[null,null,null,"diskos",null,null,0,null,null,null,null,null,68.03]
[null,null,null,"hammer",null,null,{"$f":"IF(OR(ISBLANK(E21), E21<VLOOKUP($D21,INDIRECT($I$4),6,FALSE)),0,INT(VLOOKUP($D21,INDIRECT($I$4),2,FALSE)+VLOOKUP($D21,INDIRECT($I$4),3,FALSE)*E21+VLOOKUP($D21,INDIRECT($I$4),4,FALSE)*E21*E21))","v":0},null,null,null,null,null,77.55]
[null,null,null,"spyd",null,null,{"$f":"IF(OR(ISBLANK(E22), E22<VLOOKUP($D22,INDIRECT($I$4),6,FALSE)),0,INT(VLOOKUP($D22,INDIRECT($I$4),2,FALSE)+VLOOKUP($D22,INDIRECT($I$4),3,FALSE)*E22+VLOOKUP($D22,INDIRECT($I$4),4,FALSE)*E22*E22))","v":0},null,null,null,null,null,77.27]
[null,null,null,"vægt",null,null,0,null,null,null,null,null,20.66]
[null,null,null,"Point",null,null,{"$f":"LARGE(G6:G23,1)+LARGE(G6:G23,2)+LARGE(G6:G23,3)","v":0}]
[null,null,null,"Mærke",null,null,{"$f":"IF(G24>=G28,D28,IF(G24>=G27,D27,IF(G24>=G26,D26,\"ingen\")))","v":"ingen"}]
[null,null,null,"Bronze",null,null,825]
[null,null,null,"Sølv",null,null,1900]
[null,null,null,"Guld",null,null,2500]

{"sheet":"P19_Resultater","index":20,"n_rows":28,"n_cols":13,"rows_kept":28,"cut":false,"hidden":false,"merged":[[2,4,2,6],[7,10,7,11],[8,10,8,11],[10,10,11,10]]}
[]
[]
[null,null,null,"Køn","Alder"]
[null,null,null,"P",19,null,"år",null,{"$f":"CONCATENATE(\"DAF_\",D4,E4)","v":"DAF_P19"}]
[null,null,null,null,"Res.",null,"Point"]
[null,null,null,"100m",null,null,{"$f":"IF(OR(ISBLANK(E6),E6>VLOOKUP($D6,INDIRECT($I$4),6,FALSE)),0,INT(VLOOKUP($D6,INDIRECT($I$4),2,FALSE)+VLOOKUP($D6,INDIRECT($I$4),3,FALSE)*I6+VLOOKUP($D6,INDIRECT($I$4),4,FALSE)*I6*I6))","v":0},null,{"$f":"IF(F6=\"[Man]\",ROUND(E6,1)+VLOOKUP($D6,INDIRECT($I$4),5,FALSE)/100,E6)","v":0},null,null,null,{"$f":"VLOOKUP($D6,INDIRECT($I$4),7,FALSE)","v":11.35}]
[null,null,null,"200m",null,null,{"$f":"IF(OR(ISBLANK(E7),E7>VLOOKUP($D7,INDIRECT($I$4),6,FALSE)),0,INT(VLOOKUP($D7,INDIRECT($I$4),2,FALSE)+VLOOKUP($D7,INDIRECT($I$4),3,FALSE)*I7+VLOOKUP($D7,INDIRECT($I$4),4,FALSE)*I7*I7))","v":0},null,{"$f":"IF(F7=\"[Man]\",ROUND(E7,1)+VLOOKUP($D7,INDIRECT($I$4),5,FALSE)/100,E7)","v":0},null,null,null,{"$f":"VLOOKUP($D7,INDIRECT($I$4),7,FALSE)","v":22.66}]
[null,null,null,"400m",null,null,0,null,{"$f":"IF(F8=\"[Man]\",ROUND(E8,1)+VLOOKUP($D8,INDIRECT($I$4),5,FALSE)/100,E8)","v":0},"Navn:",null,null,51.44]
[null,null,null,"800m",null,null,{"$f":"IF(OR(ISBLANK(E9), E9>VLOOKUP($D9,INDIRECT($I$4),6,FALSE)),0,INT(VLOOKUP($D9,INDIRECT($I$4),2,FALSE)+VLOOKUP($D9,INDIRECT($I$4),3,FALSE)*E9*86400+VLOOKUP($D9,INDIRECT($I$4),4,FALSE)*E9*86400*E9*86400))","v":0},null,null,"Klub:",{"$f":"IF(Info!D29=0,\" \",Info!D29)","v":"Vejle IF"},null,"00:02:01.930"]
[null,null,null,"1000m",null,null,{"$f":"IF(OR(ISBLANK(E10), E10>VLOOKUP($D10,INDIRECT($I$4),6,FALSE)),0,INT(VLOOKUP($D10,INDIRECT($I$4),2,FALSE)+VLOOKUP($D10,INDIRECT($I$4),3,FALSE)*E10*86400+VLOOKUP($D10,INDIRECT($I$4),4,FALSE)*E10*86400*E10*86400))","v":0},null,null,"(klub indtastes i Info skemaet)",null,null,"00:02:37.930"]
[null,null,null,"1500m",null,null,{"$f":"IF(OR(ISBLANK(E11), E11>VLOOKUP($D11,INDIRECT($I$4),6,FALSE)),0,INT(VLOOKUP($D11,INDIRECT($I$4),2,FALSE)+VLOOKUP($D11,INDIRECT($I$4),3,FALSE)*E11*86400+VLOOKUP($D11,INDIRECT($I$4),4,FALSE)*E11*86400*E11*86400))","v":0},null,null,null,{"$f":"Info!G28","v":"På   diplom"},null,"00:04:09.840"]
[null,null,null,"3000m",null,null,{"$f":"IF(OR(ISBLANK(E12), E12>VLOOKUP($D12,INDIRECT($I$4),6,FALSE)),0,INT(VLOOKUP($D12,INDIRECT($I$4),2,FALSE)+VLOOKUP($D12,INDIRECT($I$4),3,FALSE)*E12*86400+VLOOKUP($D12,INDIRECT($I$4),4,FALSE)*E12*86400*E12*86400))","v":0},null,null,null,null,null,"00:08:54.750"]
[null,null,null,"60mH",null,null,{"$f":"IF(OR(ISBLANK(E13),E13>VLOOKUP($D13,INDIRECT($I$4),6,FALSE)),0,INT(VLOOKUP($D13,INDIRECT($I$4),2,FALSE)+VLOOKUP($D13,INDIRECT($I$4),3,FALSE)*I13+VLOOKUP($D13,INDIRECT($I$4),4,FALSE)*I13*I13))","v":0},null,{"$f":"IF(F13=\"[Man]\",ROUND(E13,1)+VLOOKUP($D13,INDIRECT($I$4),5,FALSE)/100,E13)","v":0},null,null,null,7.87]
[null,null,null,"100mH",null,null,{"$f":"IF(OR(ISBLANK(E14),E14>VLOOKUP($D14,INDIRECT($I$4),6,FALSE)),0,INT(VLOOKUP($D14,INDIRECT($I$4),2,FALSE)+VLOOKUP($D14,INDIRECT($I$4),3,FALSE)*I14+VLOOKUP($D14,INDIRECT($I$4),4,FALSE)*I14*I14))","v":0},null,{"$f":"IF(F14=\"[Man]\",ROUND(E14,1)+VLOOKUP($D14,INDIRECT($I$4),5,FALSE)/100,E14)","v":0},null,null,null,12.96]
[null,null,null,"4x100m",null,null,0,null,{"$f":"IF(F15=\"[Man]\",ROUND(E15,1)+VLOOKUP($D15,INDIRECT($I$4),5,FALSE)/100,E15)","v":0},null,null,null,45.09]
[null,null,null,"højde",null,null,{"$f":"IF(OR(ISBLANK(E16), E16<VLOOKUP($D16,INDIRECT($I$4),6,FALSE)),0,INT(VLOOKUP($D16,INDIRECT($I$4),2,FALSE)+VLOOKUP($D16,INDIRECT($I$4),3,FALSE)*E16+VLOOKUP($D16,INDIRECT($I$4),4,FALSE)*E16*E16))","v":0},null,null,null,null,null,1.89]
[null,null,null,"længde",null,null,0,null,null,null,null,null,6.48]
[null,null,null,"stang",null,null,{"$f":"IF(OR(ISBLANK(E18), E18<VLOOKUP($D18,INDIRECT($I$4),6,FALSE)),0,INT(VLOOKUP($D18,INDIRECT($I$4),2,FALSE)+VLOOKUP($D18,INDIRECT($I$4),3,FALSE)*E18+VLOOKUP($D18,INDIRECT($I$4),4,FALSE)*E18*E18))","v":0},null,null,null,null,null,3.78]
[null,null,null,"trespring",null,null,{"$f":"IF(OR(ISBLANK(E19), E19<VLOOKUP($D19,INDIRECT($I$4),6,FALSE)),0,INT(VLOOKUP($D19,INDIRECT($I$4),2,FALSE)+VLOOKUP($D19,INDIRECT($I$4),3,FALSE)*E19+VLOOKUP($D19,INDIRECT($I$4),4,FALSE)*E19*E19))","v":0},null,null,null,null,null,12.98]
[null,null,null,"kugle",null,null,0,null,null,null,null,null,15.39]
[null,null,null,"diskos",null,null,0,null,null,null,null,null,56.49]
[null,null,null,"hammer",null,null,0,null,null,null,null,null,52.11]
[null,null,null,"spyd",null,null,0,null,null,null,null,null,65.98]
[null,null,null,"Point",null,null,{"$f":"LARGE(G6:G23,1)+LARGE(G6:G23,2)+LARGE(G6:G23,3)","v":0}]
[null,null,null,"Mærke",null,null,{"$f":"IF(G24>=G28,D28,IF(G24>=G27,D27,IF(G24>=G26,D26,\"ingen\")))","v":"ingen"}]
[null,null,null,"Bronze",null,null,825]
[null,null,null,"Sølv",null,null,1900]
[null,null,null,"Guld",null,null,2500]

{"sheet":"D19_Resultater","index":21,"n_rows":28,"n_cols":13,"rows_kept":28,"cut":false,"hidden":false,"merged":[[2,4,2,6],[7,10,7,11],[8,10,8,11],[10,10,11,10]]}
[]
[]
[null,null,null,"Køn","Alder"]
[null,null,null,"D",19,null,"år",null,{"$f":"CONCATENATE(\"DAF_\",D4,E4)","v":"DAF_D19"}]
[null,null,null,null,"Res.",null,"Point"]
[null,null,null,"100m",null,null,{"$f":"IF(OR(ISBLANK(E6),E6>VLOOKUP($D6,INDIRECT($I$4),6,FALSE)),0,INT(VLOOKUP($D6,INDIRECT($I$4),2,FALSE)+VLOOKUP($D6,INDIRECT($I$4),3,FALSE)*I6+VLOOKUP($D6,INDIRECT($I$4),4,FALSE)*I6*I6))","v":0},null,{"$f":"IF(F6=\"[Man]\",ROUND(E6,1)+VLOOKUP($D6,INDIRECT($I$4),5,FALSE)/100,E6)","v":0},null,null,null,{"$f":"VLOOKUP($D6,INDIRECT($I$4),7,FALSE)","v":10.39}]
[null,null,null,"200m",null,null,{"$f":"IF(OR(ISBLANK(E7),E7>VLOOKUP($D7,INDIRECT($I$4),6,FALSE)),0,INT(VLOOKUP($D7,INDIRECT($I$4),2,FALSE)+VLOOKUP($D7,INDIRECT($I$4),3,FALSE)*I7+VLOOKUP($D7,INDIRECT($I$4),4,FALSE)*I7*I7))","v":0},null,{"$f":"IF(F7=\"[Man]\",ROUND(E7,1)+VLOOKUP($D7,INDIRECT($I$4),5,FALSE)/100,E7)","v":0},null,null,null,{"$f":"VLOOKUP($D7,INDIRECT($I$4),7,FALSE)","v":20.83}]
[null,null,null,"400m",null,null,0,null,{"$f":"IF(F8=\"[Man]\",ROUND(E8,1)+VLOOKUP($D8,INDIRECT($I$4),5,FALSE)/100,E8)","v":0},"Navn:",null,null,46.48]
[null,null,null,"800m",null,null,{"$f":"IF(ISBLANK(E9),0,IF(INT(VLOOKUP($D9,INDIRECT($I$4),2,FALSE)+VLOOKUP($D9,INDIRECT($I$4),3,FALSE)*E9*86400+VLOOKUP($D9,INDIRECT($I$4),4,FALSE)*E9*86400*E9*86400)<0,0,INT(VLOOKUP($D9,INDIRECT($I$4),2,FALSE)+VLOOKUP($D9,INDIRECT($I$4),3,FALSE)*E9*86400+VLOOKUP($D9,INDIRECT($I$4),4,FALSE)*E9*86400*E9*86400)))","v":0},null,null,"Klub:",{"$f":"IF(Info!D29=0,\" \",Info!D29)","v":"Vejle IF"},null,"00:01:48.970"]
[null,null,null,"1000m",null,null,{"$f":"IF(ISBLANK(E10),0,IF(INT(VLOOKUP($D10,INDIRECT($I$4),2,FALSE)+VLOOKUP($D10,INDIRECT($I$4),3,FALSE)*E10*86400+VLOOKUP($D10,INDIRECT($I$4),4,FALSE)*E10*86400*E10*86400)<0,0,INT(VLOOKUP($D10,INDIRECT($I$4),2,FALSE)+VLOOKUP($D10,INDIRECT($I$4),3,FALSE)*E10*86400+VLOOKUP($D10,INDIRECT($I$4),4,FALSE)*E10*86400*E10*86400)))","v":0},null,null,"(klub indtastes i Info skemaet)",null,null,"00:02:20.680"]
[null,null,null,"1500m",null,null,0,null,null,null,{"$f":"Info!G28","v":"På   diplom"},null,"00:03:43.940"]
[null,null,null,"3000m",null,null,0,null,null,null,null,null,"00:08:04.950"]
[null,null,null,"110mH",null,null,{"$f":"IF(OR(ISBLANK(E13),E13>VLOOKUP($D13,INDIRECT($I$4),6,FALSE)),0,INT(VLOOKUP($D13,INDIRECT($I$4),2,FALSE)+VLOOKUP($D13,INDIRECT($I$4),3,FALSE)*I13+VLOOKUP($D13,INDIRECT($I$4),4,FALSE)*I13*I13))","v":0},null,{"$f":"IF(F13=\"[Man]\",ROUND(E13,1)+VLOOKUP($D13,INDIRECT($I$4),5,FALSE)/100,E13)","v":0},null,null,null,13.67]
[null,null,null,"4x100m",null,null,0,null,{"$f":"IF(F14=\"[Man]\",ROUND(E14,1)+VLOOKUP($D14,INDIRECT($I$4),5,FALSE)/100,E14)","v":0},null,null,null,41.06]
[null,null,null,"højde",null,null,{"$f":"IF(OR(ISBLANK(E15), E15<VLOOKUP($D15,INDIRECT($I$4),6,FALSE)),0,INT(VLOOKUP($D15,INDIRECT($I$4),2,FALSE)+VLOOKUP($D15,INDIRECT($I$4),3,FALSE)*E15+VLOOKUP($D15,INDIRECT($I$4),4,FALSE)*E15*E15))","v":0},null,null,null,null,null,2.2599999999999998]
[null,null,null,"længde",null,null,0,null,null,null,null,null,7.8]
[null,null,null,"stang",null,null,{"$f":"IF(OR(ISBLANK(E17), E17<VLOOKUP($D17,INDIRECT($I$4),6,FALSE)),0,INT(VLOOKUP($D17,INDIRECT($I$4),2,FALSE)+VLOOKUP($D17,INDIRECT($I$4),3,FALSE)*E17+VLOOKUP($D17,INDIRECT($I$4),4,FALSE)*E17*E17))","v":0},null,null,null,null,null,5.36]
[null,null,null,"trespring",null,null,{"$f":"IF(OR(ISBLANK(E18), E18<VLOOKUP($D18,INDIRECT($I$4),6,FALSE)),0,INT(VLOOKUP($D18,INDIRECT($I$4),2,FALSE)+VLOOKUP($D18,INDIRECT($I$4),3,FALSE)*E18+VLOOKUP($D18,INDIRECT($I$4),4,FALSE)*E18*E18))","v":0},null,null,null,null,null,15.97]
[null,null,null,"kugle",null,null,{"$f":"IF(OR(ISBLANK(E19), E19<VLOOKUP($D19,INDIRECT($I$4),6,FALSE)),0,INT(VLOOKUP($D19,INDIRECT($I$4),2,FALSE)+VLOOKUP($D19,INDIRECT($I$4),3,FALSE)*E19+VLOOKUP($D19,INDIRECT($I$4),4,FALSE)*E19*E19))","v":0},null,null,null,null,null,20.66]
[null,null,null,"diskos",null,null,0,null,null,null,null,null,68.03]
[null,null,null,"hammer",null,null,{"$f":"IF(OR(ISBLANK(E21), E21<VLOOKUP($D21,INDIRECT($I$4),6,FALSE)),0,INT(VLOOKUP($D21,INDIRECT($I$4),2,FALSE)+VLOOKUP($D21,INDIRECT($I$4),3,FALSE)*E21+VLOOKUP($D21,INDIRECT($I$4),4,FALSE)*E21*E21))","v":0},null,null,null,null,null,77.55]
[null,null,null,"spyd",null,null,{"$f":"IF(OR(ISBLANK(E22), E22<VLOOKUP($D22,INDIRECT($I$4),6,FALSE)),0,INT(VLOOKUP($D22,INDIRECT($I$4),2,FALSE)+VLOOKUP($D22,INDIRECT($I$4),3,FALSE)*E22+VLOOKUP($D22,INDIRECT($I$4),4,FALSE)*E22*E22))","v":0},null,null,null,null,null,77.27]
[null,null,null,"vægt",null,null,0,null,null,null,null,null,20.66]
[null,null,null,"Point",null,null,{"$f":"LARGE(G6:G23,1)+LARGE(G6:G23,2)+LARGE(G6:G23,3)","v":0}]
[null,null,null,"Mærke",null,null,{"$f":"IF(G24>=G28,D28,IF(G24>=G27,D27,IF(G24>=G26,D26,\"ingen\")))","v":"ingen"}]
[null,null,null,"Bronze",null,null,825]
[null,null,null,"Sølv",null,null,1900]
[null,null,null,"Guld",null,null,2500]

{"sheet":"Pointformler","index":22,"n_rows":223,"n_cols":30,"rows_kept":223,"cut":false,"hidden":false,"merged":[]}
[null,"A","B","C",null,null,null,null,null,null,null,null,null,"A","B","C",null,null,null,null,null,null,null,null,null,null,null,null,"Drenge","Piger"]
["  DAF_D9:",null,null,null,null,null,null,null,null,null,null,null,null,null,null,null,null,null,null,null,null,null,null,null,null,null,null,4,"DAF_D9","DAF_P9"]
["40m",843.56813,305.86700999999999,-39.589348999999999,24,9.8800000000000008,6.3,1199,null,null,null,null,null,null,null,null,null,null,null,null,null,null,null,null,null,null,null,5,"DAF_D9","DAF_P9"]
["400m",3776.7145,-40.896439000000001,7.3921612999999997E-2,14,117.11,72.5,1200,null,null,null,null,null,null,null,null,null,null,null,null,null,null,null,null,null,null,null,6,"DAF_D9","DAF_P9"]
["800m",2802.3229000000001,-10.947062000000001,2.9369169999999998E-3,0,"00:04:36.380","00:02:32.610",1200,null,null,null,null,null,null,null,null,null,null,null,null,null,null,null,null,null,null,null,7,"DAF_D9","DAF_P9"]
["4x40m",998.54263000000003,68.068411999999995,-2.4078561999999999,24,38.909999999999997,24.91,1200,null,null,null,null,null,null,null,null,null,null,null,null,null,null,null,null,null,null,null,8,"DAF_D9","DAF_P9"]
["højde",-1266.2928999999999,1936.539,29.512535,0,0.65,1.25,1200,null,null,null,null,null,null,null,null,null,null,null,null,null,null,null,null,null,null,null,9,"DAF_D9","DAF_P9"]
["længde",-586.31550000000004,288.81527,38.890897000000002,0,1.67,4.01,1197,null,null,null,null,null,null,null,null,null,null,null,null,null,null,null,null,null,null,null,10,"DAF_D11","DAF_P11"]
["kugle",-448.71,231.03,-6.4151999999999996,0,2.0699999999999998,9.81,1200,null,null,null,null,null,null,null,null,null,null,null,null,null,null,null,null,null,null,null,11,"DAF_D11","DAF_P11"]
["bold",-272.32769999999999,32.269202999999997,-7.7919770999999999E-2,0,8.66,52.21,1200,null,null,null,null,null,null,null,null,null,null,null,null,null,null,null,null,null,null,null,12,"DAF_D13","DAF_P13"]
[null,null,null,null,null,null,null,null,null,null,null,null,null,null,null,null,null,null,null,null,null,null,null,null,null,null,null,13,"DAF_D13","DAF_P13"]
[null,null,null,null,null,null,null,null,null,null,null,null,null,null,null,null,null,null,null,null,null,null,null,null,null,null,null,14,"DAF_D15","DAF_P15"]
["  DAF_D11:",null,null,null,null,null,null,null,null,null,null,null,"  DAF_D10:",null,null,null,null,null,null,null,null,null,null,null,null,null,null,15,"DAF_D15","DAF_P15"]
["60m",6459.6818000000003,-834.88415999999995,25.921111,24,12.91,8.59,1200,null,null,null,null,"60m",6459.6818000000003,-834.88415999999995,25.921111,24,12.91,8.59,1200,null,null,null,null,null,null,null,16,"DAF_D17","DAF_P17"]
["400m",5444.6530000000002,-91.775440000000003,0.3612378,14,94.36,60.79,1200,null,null,null,null,"400m",5444.6530000000002,-91.775440000000003,0.3612378,14,94.36,60.79,1200,null,null,null,null,null,null,null,17,"DAF_D17","DAF_P17"]
["1000m",4956.5267999999996,-26.530196,3.3618547999999998E-2,0,"00:05:03.540","00:03:04.930",1200,null,null,null,null,"1000m",4956.5267999999996,-26.530196,3.3618547999999998E-2,0,"00:05:03.540","00:03:04.930",1200,null,null,null,null,null,null,null,18,"DAF_D19","DAF_P19"]
["60mH",4426.1662999999999,-391.16642000000002,8.4556377000000005,24,19.71,10.74,1200,null,null,null,null,"60mH",4426.1662999999999,-391.16642000000002,8.4556377000000005,24,19.71,10.74,1200,null,null,null,null,null,null,null,19,"DAF_D19","DAF_P19"]
["4x60m",6315.1770999999999,-206.64689000000001,1.6234189999999999,24,50.94,33.64,1200,null,null,null,null,"4x60m",6315.1770999999999,-206.64689000000001,1.6234189999999999,24,50.94,33.64,1200]
["højde",-1647.9650999999999,2284.2512000000002,-271.05405000000002,0,0.8,1.52,1197,null,null,null,null,"højde",-1647.9650999999999,2284.2512000000002,-271.05405000000002,0,0.8,1.52,1197]
["længde",-1402.2554,681.70829000000003,-32.964748999999998,0,2.3199999999999998,5.05,1199,null,null,null,null,"længde",-1402.2554,681.70829000000003,-32.964748999999998,0,2.3199999999999998,5.05,1199]
["kugle",-528.62282000000005,230.99575999999999,-6.4124340999999996,0,2.4700000000000002,10.61,1200,null,null,null,null,"kugle",-528.62282000000005,230.99575999999999,-6.4124340999999996,0,2.4700000000000002,10.61,1200]
["bold",-726.99617999999998,51.113221000000003,-0.31653345999999999,0,15.79,59.98,1200,null,null,null,null,"bold",-726.99617999999998,51.113221000000003,-0.31653345999999999,0,15.79,59.98,1200]
[]
[]
["  DAF_D13:",null,null,null,null,null,null,null,null,null,null,null,"  DAF_D12:"]
["80m",6349.3365000000003,-774.24543000000006,23.397963000000001,24,14.98,9.2200000000000006,1199,null,null,null,null,"80m",6349.3365000000003,-774.24543000000006,23.397963000000001,24,14.98,9.2200000000000006,1199]
["200m",5674.7852000000003,-271.51763999999997,3.2485488999999999,24,42.24,22.58,1200,null,null,null,null,"200m",5674.7852000000003,-271.51763999999997,3.2485488999999999,24,42.24,22.58,1200]
["600m",4935.0726999999997,-54.822215,0.15326877999999999,0,"00:02:58.840","00:01:31.560",1200,null,null,null,null,"600m",4935.0726999999997,-54.822215,0.15326877999999999,0,"00:02:58.840","00:01:31.560",1200]
["1000m",6280.0046000000002,-45.898487000000003,8.4016553999999993E-2,0,"00:04:33.140","00:02:34.190",1200,null,null,null,null,"1000m",6280.0046000000002,-45.898487000000003,8.4016553999999993E-2,0,"00:04:33.140","00:02:34.190",1200]
["60mH",3927.1691000000001,-410.25169,10.764613000000001,24,null,null,1200,null,null,null,null,"60mH",3927.1691000000001,-410.25169,10.764613000000001,24,null,null,1200]
["80mH",4136.5770000000002,-358.36138999999997,7.8180446999999997,24,22.93,10.69,1199,null,null,null,null,"80mH",4136.5770000000002,-358.36138999999997,7.8180446999999997,24,22.93,10.69,1199]
["4x80m",5005.3235999999997,-130.27444,0.83439189000000002,24,68.23,38.9,1200,null,null,null,null,"4x80m",5005.3235999999997,-130.27444,0.83439189000000002,24,68.23,38.9,1200]
["højde",-1034.9979000000001,842.14125999999999,177.84027,0,1.02,1.89,1191,null,null,null,null,"højde",-1034.9979000000001,842.14125999999999,177.84027,0,1.02,1.89,1191]
["stang",-187.56187,124.36828,64.000816,0,1.01,3.78,1197,null,null,null,null,"stang",-187.56187,124.36828,64.000816,0,1.01,3.78,1197]
["længde",-621.05264999999997,226.52163999999999,8.9429072000000005,0,2.5,6.41,1198,null,null,null,null,"længde",-621.05264999999997,226.52163999999999,8.9429072000000005,0,2.5,6.41,1198]
["kugle",-603.87946999999997,151.47984,-2.5379155999999998,0,4.3099999999999996,16.440000000000001,1200,null,null,null,null,"kugle",-603.87946999999997,151.47984,-2.5379155999999998,0,4.3099999999999996,16.440000000000001,1200]
["diskos",-338.67333000000002,37.990535000000001,-0.18134615000000001,0,9.36,54.88,1200,null,null,null,null,"diskos",-338.67333000000002,37.990535000000001,-0.18134615000000001,0,9.36,54.88,1200]
["hammer",-338.67333000000002,37.990535000000001,-0.18134615000000001,0,9.36,54.88,1200,null,null,null,null,"hammer",-338.67333000000002,37.990535000000001,-0.18134615000000001,0,9.36,54.88,1200]
["spyd",-225.52620999999999,39.213040999999997,-0.24128667000000001,0,6,54.9,1200,null,null,null,null,"spyd",-225.52620999999999,39.213040999999997,-0.24128667000000001,0,6,54.9,1200]
["bold",-594.95875999999998,33.930087,-0.14989394,0,19.2,84.29,1200,null,null,null,null,"bold",-594.95875999999998,33.930087,-0.14989394,0,19.2,84.29,1200]
[]
[]
["  DAF_D15:",null,null,null,null,null,null,null,null,null,null,null,"  DAF_D14:"]
["60m",6748.1737999999996,-1107.9659999999999,45.524318000000001,24,12.16,7.05,1199,null,null,null,null,"60m",6748.1737999999996,-1107.9659999999999,45.524318000000001,24,12.16,7.05,1199]
["100m",5965.4768999999997,-634.37721999999997,16.890471000000002,24,18.77,10.38,1200,null,null,null,null,"100m",5965.4768999999997,-634.37721999999997,16.890471000000002,24,18.77,10.38,1200]
["200m",5319.4612999999999,-269.34600999999998,3.4225433000000001,24,39.340000000000003,20.78,1200,null,null,null,null,"200m",5319.4612999999999,-269.34600999999998,3.4225433000000001,24,39.340000000000003,20.78,1200]
["300m",5858.7645000000002,-187.82006000000001,1.5115816,24,62.12,34.229999999999997,1200,null,null,null,null,"300m",5858.7645000000002,-187.82006000000001,1.5115816,24,62.12,34.229999999999997,1200]
["800m",6055.6576999999997,-61.835473,0.15857415,0,"00:03:14.960","00:01:48.980",1200,null,null,null,null,"800m",6055.6576999999997,-61.835473,0.15857415,0,"00:03:14.960","00:01:48.980",1200]
["1000m",5785.4261999999999,-44.893303000000003,8.7503598000000002E-2,0,"00:04:16.500","00:02:20.750",1200,null,null,null,null,"1000m",5785.4261999999999,-44.893303000000003,8.7503598000000002E-2,0,"00:04:16.500","00:02:20.750",1200]
["1500m",5628.8827000000001,-27.131259,3.2850903000000001E-2,0,"00:06:52.940","00:03:43.970",1200,null,null,null,null,"1500m",5628.8827000000001,-27.131259,3.2850903000000001E-2,0,"00:06:52.940","00:03:43.970",1200]
["3000m",5368.3725000000004,-11.703417,6.4107260000000003E-3,0,"00:15:12.780","00:08:05.020",1200,null,null,null,null,"3000m",5368.3725000000004,-11.703417,6.4107260000000003E-3,0,"00:15:12.780","00:08:05.020",1200]
["60mH",3922.2159999999999,-434.71447999999998,12.076257,24,18,8.07,1200,null,null,null,null,"60mH",3922.2159999999999,-434.71447999999998,12.076257,24,18,8.07,1200]
["100mH",4706.5402999999997,-362.68795,7.0615892999999996,24,25.68,12.92,1199,null,null,null,null,"100mH",4706.5402999999997,-362.68795,7.0615892999999996,24,25.68,12.92,1199]
["300mH",4101.2443999999996,-104.84748999999999,0.67255399999999999,24,77.95,35.97,1200,null,null,null,null,"300mH",4101.2443999999996,-104.84748999999999,0.67255399999999999,24,77.95,35.97,1200]
["1500mFH",6376.4089000000004,-29.597344,3.4533900999999999E-2,0,"00:07:08.510","00:04:04.830",1200,null,null,null,null,"1500mFH",6376.4089000000004,-29.597344,3.4533900999999999E-2,0,"00:07:08.510","00:04:04.830",1200]
["4x100m",5472.7402000000002,-136.21556000000001,0.85184963999999996,14,79.94,42.85,1200,null,null,null,null,"4x100m",5472.7402000000002,-136.21556000000001,0.85184963999999996,14,79.94,42.85,1200]
["højde",-1665.7483999999999,1762.1931999999999,-210.73724999999999,0,1.0900000000000001,2.21,1199,null,null,null,null,"højde",-1665.7483999999999,1762.1931999999999,-210.73724999999999,0,1.0900000000000001,2.21,1199]
["stang",-346.16188,335.75268999999997,-8.0916739999999994,0,1.07,5.27,1198,null,null,null,null,"stang",-346.16188,335.75268999999997,-8.0916739999999994,0,1.07,5.27,1198]
["længde",-704.03976,242.60768999999999,0.19513446000000001,0,2.9,7.8,1200,null,null,null,null,"længde",-704.03976,242.60768999999999,0.19513446000000001,0,2.9,7.8,1200]
["kugle",-397.70200999999997,117.78297999999999,-1.9559515000000001,0,3.61,20.64,1200,null,null,null,null,"kugle",-397.70200999999997,117.78297999999999,-1.9559515000000001,0,3.61,20.64,1200]
["diskos",-350.87491999999997,38.099834000000001,-0.22461476999999999,0,9.81,67.83,1200,null,null,null,null,"diskos",-350.87491999999997,38.099834000000001,-0.22461476999999999,0,9.81,67.83,1200]
["hammer",-350.87491999999997,38.099834000000001,-0.22461476999999999,0,9.81,67.83,1200,null,null,null,null,"hammer",-350.87491999999997,38.099834000000001,-0.22461476999999999,0,9.81,67.83,1200]
["spyd",-319.77877000000001,26.613139,-0.10310353,0,12.68,85.29,1200,null,null,null,null,"spyd",-319.77877000000001,26.613139,-0.10310353,0,12.68,85.29,1200]
[]
[]
["  DAF_D17:",null,null,null,null,null,null,null,null,null,null,null,"  DAF_D16:"]
["60m",6306.8369000000002,-1070.3403000000001,45.460054,24,null,null,1200,null,null,null,null,"60m",6306.8369000000002,-1070.3403000000001,45.460054,24,null,null,1200]
["100m",5983.1054000000004,-636.79600000000005,16.972057,24,18.760000000000002,10.39,1198,null,null,null,null,"100m",5983.1054000000004,-636.79600000000005,16.972057,24,18.760000000000002,10.39,1198]
["200m",5407.6722,-274.22996000000001,3.4697171,24,37.67,20.83,1200,null,null,null,null,"200m",5407.6722,-274.22996000000001,3.4697171,24,37.67,20.83,1200]
["400m",5429.9341000000004,-124.07353000000001,0.71151238000000006,14,87.19,46.48,1200,null,null,null,null,"400m",5429.9341000000004,-124.07353000000001,0.71151238000000006,14,87.19,46.48,1200]
["800m",6031.2112999999999,-61.484586,0.15738741000000001,0,"00:03:15.330","00:01:48.970",1200,null,null,null,null,"800m",6031.2112999999999,-61.484586,0.15738741000000001,0,"00:03:15.330","00:01:48.970",1200]
["1000m",5762.8779000000004,-44.665194,8.6945821000000006E-2,0,"00:04:16.850","00:02:20.680",1200,null,null,null,null,"1000m",5762.8779000000004,-44.665194,8.6945821000000006E-2,0,"00:04:16.850","00:02:20.680",1200]
["1500m",5619.3985000000002,-27.068501999999999,3.2753479000000002E-2,0,"00:06:53.220","00:03:43.940",1200,null,null,null,null,"1500m",5619.3985000000002,-27.068501999999999,3.2753479000000002E-2,0,"00:06:53.220","00:03:43.940",1200]
["3000m",5360.9132,-11.68141,6.3955720000000004E-3,0,"00:15:13.160","00:08:04.950",1200,null,null,null,null,"3000m",5360.9132,-11.68141,6.3955720000000004E-3,0,"00:15:13.160","00:08:04.950",1200]
["60mH",4336.0640000000003,-543.69014000000004,17.142651999999998,24,15.5,7.58,1199,null,null,null,null,"60mH",4336.0640000000003,-543.69014000000004,17.142651999999998,24,15.5,7.58,1199]
["110mH",4803.2235000000001,-352.65210999999999,6.5159893000000002,24,26.86,13.67,1200,null,null,null,null,"110mH",4803.2235000000001,-352.65210999999999,6.5159893000000002,24,26.86,13.67,1200]
["4x100m",5210.7613000000001,-132.26795999999999,0.84244775000000005,14,78.5,41.06,1200,null,null,null,null,"4x100m",5210.7613000000001,-132.26795999999999,0.84244775000000005,14,78.5,41.06,1200]
["højde",-1727.7602999999999,1739.9368999999999,-196.57184000000001,0,1.1499999999999999,2.2599999999999998,1200,null,null,null,null,"højde",-1727.7602999999999,1739.9368999999999,-196.57184000000001,0,1.1499999999999999,2.2599999999999998,1200]
["stang",-523.25153,424.93533000000002,-19.322682,0,1.32,5.36,1199,null,null,null,null,"stang",-523.25153,424.93533000000002,-19.322682,0,1.32,5.36,1199]
["længde",-706.99438999999995,244.23993999999999,4.1878760000000001E-2,0,2.9,7.8,1200,null,null,null,null,"længde",-706.99438999999995,244.23993999999999,4.1878760000000001E-2,0,2.9,7.8,1200]
["trespring",-785.92263000000003,88.816361000000001,2.2270322,0,7.47,15.97,1200,null,null,null,null,"trespring",-785.92263000000003,88.816361000000001,2.2270322,0,7.47,15.97,1200]
["kugle",-405.76652999999999,118.79011,-1.987684,0,3.65,20.66,1200,null,null,null,null,"kugle",-405.76652999999999,118.79011,-1.987684,0,3.65,20.66,1200]
["diskos",-358.24462999999997,38.434398000000002,-0.22826487000000001,0,9.94,68.03,1200,null,null,null,null,"diskos",-358.24462999999997,38.434398000000002,-0.22826487000000001,0,9.94,68.03,1200]
["hammer",-347.84832999999998,30.385149999999999,-0.13442967,0,12.14,77.55,1200,null,null,null,null,"hammer",-347.84832999999998,30.385149999999999,-0.13442967,0,12.14,77.55,1200]
["spyd",-350.6293,30.592797999999998,-0.13619758000000001,0,12.16,77.27,1200,null,null,null,null,"spyd",-350.6293,30.592797999999998,-0.13619758000000001,0,12.16,77.27,1200]
["vægt",-405.76652999999999,118.79011,-1.987684,0,3.65,20.66,1200,null,null,null,null,"vægt",-405.76652999999999,118.79011,-1.987684,0,3.65,20.66,1200]
[]
[]
["  DAF_D19:",null,null,null,null,null,null,null,null,null,null,null,"  DAF_D18:"]
["60m",6306.8369000000002,-1070.3403000000001,45.460054,24,null,null,1200,null,null,null,null,"60m",6306.8369000000002,-1070.3403000000001,45.460054,24,null,null,1200]
["100m",5983.1054000000004,-636.79600000000005,16.972057,24,18.760000000000002,10.39,1200,null,null,null,null,"100m",5983.1130000000003,-636.79646000000002,16.972057,24,18.760000000000002,10.39,1200]
["200m",5407.6722,-274.22996000000001,3.4697171,24,37.67,20.83,1200,null,null,null,null,"200m",5408.4,-274.3,3.4714,24,37.67,20.83,1200]
["400m",5429.9341000000004,-124.07353000000001,0.71151238000000006,14,87.19,46.48,1200,null,null,null,null,"400m",5429.9341000000004,-124.07353000000001,0.71151238000000006,14,87.19,46.48,1200]
["800m",6031.2112999999999,-61.484586,0.15738741000000001,0,"00:03:15.330","00:01:48.970",1200,null,null,null,null,"800m",6031.2112999999999,-61.484586,0.15738741000000001,0,"00:03:15.330","00:01:48.970",1200]
["1000m",5762.8779000000004,-44.665194,8.6945821000000006E-2,0,"00:04:16.850","00:02:20.680",1200,null,null,null,null,"1000m",5762.8779000000004,-44.665194,8.6945821000000006E-2,0,"00:04:16.850","00:02:20.680",1200]
["1500m",5619.3985000000002,-27.068501999999999,3.2753479000000002E-2,0,"00:06:53.220","00:03:43.940",1200,null,null,null,null,"1500m",5619.3985000000002,-27.068501999999999,3.2753479000000002E-2,0,"00:06:53.220","00:03:43.940",1200]
["3000m",5360.9132,-11.68141,6.3955720000000004E-3,0,"00:15:13.160","00:08:04.950",1200,null,null,null,null,"3000m",5360.9132,-11.68141,6.3955720000000004E-3,0,"00:15:13.160","00:08:04.950",1200]
["60mH",4336.0640000000003,-543.69014000000004,17.142651999999998,24,null,null,1200,null,null,null,null,"60mH",4336.0640000000003,-543.69014000000004,17.142651999999998,24,null,null,1200]
["110mH",4803.2235000000001,-352.65210999999999,6.5159893000000002,24,26.86,13.67,1200,null,null,null,null,"110mH",4803.2235000000001,-352.65210999999999,6.5159893000000002,24,26.86,13.67,1200]
["4x100m",5210.7613000000001,-132.26795999999999,0.84244775000000005,14,78.5,41.06,1200,null,null,null,null,"4x100m",5210.7613000000001,-132.26795999999999,0.84244775000000005,14,78.5,41.06,1200]
["højde",-1727.7602999999999,1739.9368999999999,-196.57184000000001,0,1.1499999999999999,2.2599999999999998,1200,null,null,null,null,"højde",-1727.7602999999999,1739.9368999999999,-196.57184000000001,0,1.1499999999999999,2.2599999999999998,1200]
["stang",-523.25153,424.93533000000002,-19.322682,0,1.32,5.36,1199,null,null,null,null,"stang",-523.25153,424.93533000000002,-19.322682,0,1.32,5.36,1199]
["længde",-706.99438999999995,244.23993999999999,4.1878760000000001E-2,0,2.9,7.8,1200,null,null,null,null,"længde",-706.99438999999995,244.23993999999999,4.1878760000000001E-2,0,2.9,7.8,1200]
["trespring",-785.92263000000003,88.816361000000001,2.2270322,0,7.47,15.97,1200,null,null,null,null,"trespring",-785.92263000000003,88.816361000000001,2.2270322,0,7.47,15.97,1200]
["kugle",-405.76652999999999,118.79011,-1.987684,0,3.65,20.66,1200,null,null,null,null,"kugle",-405.76652999999999,118.79011,-1.987684,0,3.65,20.66,1200]
["diskos",-358.24462999999997,38.434398000000002,-0.22826487000000001,0,9.94,68.03,1200,null,null,null,null,"diskos",-358.24462999999997,38.434398000000002,-0.22826487000000001,0,9.94,68.03,1200]
["hammer",-347.84832999999998,30.385149999999999,-0.13442967,0,12.14,77.55,1200,null,null,null,null,"hammer",-347.84832999999998,30.385149999999999,-0.13442967,0,12.14,77.55,1200]
["spyd",-350.6293,30.592797999999998,-0.13619758000000001,0,12.16,77.27,1200,null,null,null,null,"spyd",-350.6293,30.592797999999998,-0.13619758000000001,0,12.16,77.27,1200]
["vægt",-405.76652999999999,118.79011,-1.987684,0,3.65,20.66,1200,null,null,null,null,"vægt",-405.76652999999999,118.79011,-1.987684,0,3.65,20.66,1200]
[]
[]
["  DAF_P9:"]
["40m",845.41180999999995,305.40741000000003,-39.561616999999998,24,9.8800000000000008,6.3,1199]
["400m",3776.7145,-40.896439000000001,7.3921612999999997E-2,14,117.11,72.5,1200]
["800m",2802.3229000000001,-10.947062000000001,2.9369169999999998E-3,0,"00:04:36.380","00:02:32.610",1200]
["4x40m",998.54263000000003,68.068411999999995,-2.4078561999999999,24,38.909999999999997,24.91,1200]
["højde",-1266.5686000000001,1937.2737,29.072814000000001,0,0.65,1.25,1200]
["længde",-584.26260000000002,287.55157000000003,39.081553999999997,0,1.67,4.01,1197]
["kugle",-386.09278,263.72590000000002,-8.4215402000000008,0,1.55,8.1199999999999992,1200]
["bold",-407.69332000000003,61.072305,-0.56264267000000001,0,7.17,44.89,1200]
[]
[]
["  DAF_P11:",null,null,null,null,null,null,null,null,null,null,null,"  DAF_P10:"]
["60m",5954.4753000000001,-725.37676999999996,21.281366999999999,24,13.77,8.86,1198,null,null,null,null,"60m",5954.4753000000001,-725.37676999999996,21.281366999999999,24,13.77,8.86,1198]
["400m",3885.6426999999999,-51.952773999999998,0.14892366000000001,14,108.54,63.1,1200,null,null,null,null,"400m",3885.6426999999999,-51.952773999999998,0.14892366000000001,14,108.54,63.1,1200]
["1000m",4688.5131000000001,-23.467210000000001,2.8116952000000001E-2,0,"00:05:31.060","00:03:13.520",1200,null,null,null,null,"1000m",4688.5131000000001,-23.467210000000001,2.8116952000000001E-2,0,"00:05:31.060","00:03:13.520",1200]
["60mH",3885.8636999999999,-306.02859999999998,5.8472672000000001,24,21.65,11.15,1200,null,null,null,null,"60mH",3885.8636999999999,-306.02859999999998,5.8472672000000001,24,21.65,11.15,1200]
["4x60m",5828.1891999999998,-179.57445999999999,1.3316707000000001,24,54.37,34.700000000000003,1200,null,null,null,null,"4x60m",5828.1891999999998,-179.57445999999999,1.3316707000000001,24,54.37,34.700000000000003,1200]
["højde",-1738.0268000000001,2778.9674,-526.77557000000002,0,0.73,1.46,1196,null,null,null,null,"højde",-1738.0268000000001,2778.9674,-526.77557000000002,0,0.73,1.46,1196]
["længde",-1386.4603999999999,777.31596000000002,-50.314715999999997,0,2.06,4.8499999999999996,1199,null,null,null,null,"længde",-1386.4603999999999,777.31596000000002,-50.314715999999997,0,2.06,4.8499999999999996,1199]
["kugle",-541.44426999999996,280.18034,-10.864544,0,2.11,10.45,1200,null,null,null,null,"kugle",-541.44426999999996,280.18034,-10.864544,0,2.11,10.45,1200]
["bold",-674.03233,58.136996000000003,-0.44521761999999998,0,12.89,57.97,1200,null,null,null,null,"bold",-674.03233,58.136996000000003,-0.44521761999999998,0,12.89,57.97,1200]
[]
[]
["  DAF_P13:",null,null,null,null,null,null,null,null,null,null,null,"  DAF_P12:"]
["80m",7499.4907000000003,-925.24206000000004,28.642088999999999,24,16.3,9.76,1197,null,null,null,null,"80m",7499.4907000000003,-925.24206000000004,28.642088999999999,24,16.3,9.76,1197]
["200m",6319.1786000000002,-292.48433999999997,3.3954816999999999,24,43.07,24.43,1200,null,null,null,null,"200m",6319.1786000000002,-292.48433999999997,3.3954816999999999,24,43.07,24.43,1200]
["600m",3389.3582999999999,-29.16377,6.3358924999999996E-2,0,"00:03:50.150","00:01:34.450",1200,null,null,null,null,"600m",3389.3582999999999,-29.16377,6.3358924999999996E-2,0,"00:03:50.150","00:01:34.450",1200]
["1000m",6594.1184000000003,-46.477060999999999,8.2235329999999995E-2,0,"00:04:42.580","00:02:43.160",1200,null,null,null,null,"1000m",6594.1184000000003,-46.477060999999999,8.2235329999999995E-2,0,"00:04:42.580","00:02:43.160",1200]
["60mH",4084.1813000000002,-412.15510999999998,10.490657000000001,24,19.64,9.11,1200,null,null,null,null,"60mH",4084.1813000000002,-412.15510999999998,10.490657000000001,24,19.64,9.11,1200]
["4x80m",5269.21,-133.61199999999999,0.83439189000000002,24,70.23,40.9,1200,null,null,null,null,"4x80m",5269.21,-133.61199999999999,0.83439189000000002,24,70.23,40.9,1200]
["højde",-1132.4367,1714.8681999999999,-201.69140999999999,0,0.73,1.7,1199,null,null,null,null,"højde",-1132.4367,1714.8681999999999,-201.69140999999999,0,0.73,1.7,1199]
["stang",-193.16522000000001,113.85171,81.901588000000004,0,1,3.48,1194,null,null,null,null,"stang",-193.16522000000001,113.85171,81.901588000000004,0,1,3.48,1194]
["længde",-736.66633999999999,277.33091999999999,6.6662346000000001,0,2.5099999999999998,6.09,1199,null,null,null,null,"længde",-736.66633999999999,277.33091999999999,6.6662346000000001,0,2.5099999999999998,6.09,1199]
["kugle",-570.65578000000005,189.80376999999999,-4.6524394999999998,0,3.28,14.44,1200,null,null,null,null,"kugle",-570.65578000000005,189.80376999999999,-4.6524394999999998,0,3.28,14.44,1200]
["diskos",-246.90595999999999,37.818117000000001,-0.12983645999999999,0,6.71,45.31,1200,null,null,null,null,"diskos",-246.90595999999999,37.818117000000001,-0.12983645999999999,0,6.71,45.31,1200]
["hammer",-312.83278999999999,53.087805000000003,-0.39949066,0,6.21,41.39,1200,null,null,null,null,"hammer",-312.83278999999999,53.087805000000003,-0.39949066,0,6.21,41.39,1200]
["spyd",-242.77779000000001,39.885354999999997,-0.11423124,0,6.23,40.99,1200,null,null,null,null,"spyd",-242.77779000000001,39.885354999999997,-0.11423124,0,6.23,40.99,1200]
["bold",-593.02372000000003,36.420929000000001,-0.15063181,0,17.59,68.819999999999993,1200,null,null,null,null,"bold",-593.02372000000003,36.420929000000001,-0.15063181,0,17.59,68.819999999999993,1200]
[]
[]
["  DAF_P15:",null,null,null,null,null,null,null,null,null,null,null,"  DAF_P14:"]
["60m",7309.9645,-1152.7844,45.491022000000001,24,12.67,7.55,1199,null,null,null,null,"60m",7309.9645,-1152.7844,45.491022000000001,24,12.67,7.55,1199]
["100m",5700.7296999999999,-544.70798000000002,13.050853,24,20.87,11.35,1199,null,null,null,null,"100m",5700.7296999999999,-544.70798000000002,13.050853,24,20.87,11.35,1199]
["200m",4696.3235999999997,-204.61913000000001,2.2378695,24,45.72,22.74,1200,null,null,null,null,"200m",4696.3235999999997,-204.61913000000001,2.2378695,24,45.72,22.74,1200]
["300m",5488.4533000000001,-161.06379000000001,1.1858660999999999,24,67.91,36.35,1200,null,null,null,null,"300m",5488.4533000000001,-161.06379000000001,1.1858660999999999,24,67.91,36.35,1200]
["800m",5259.1997000000001,-45.194360000000003,9.7661976999999997E-2,0,"00:03:51.380","00:02:01.950",1200,null,null,null,null,"800m",5259.1997000000001,-45.194360000000003,9.7661976999999997E-2,0,"00:03:51.380","00:02:01.950",1200]
["1000m",5562.7186000000002,-37.843452999999997,6.4719342999999999E-2,0,"00:04:52.370","00:02:37.940",1200,null,null,null,null,"1000m",5562.7186000000002,-37.843452999999997,6.4719342999999999E-2,0,"00:04:52.370","00:02:37.940",1200]
["1500m",5116.5140000000001,-21.182618000000002,2.2056122000000001E-2,0,"00:08:00.190","00:04:09.930",1200,null,432.9,{"$f":"B159+C159*J159+D159*J159*J159","v":79.929085854018922},null,"1500m",5116.5140000000001,-21.182618000000002,2.2056122000000001E-2,0,"00:08:00.190","00:04:09.930",1200,null,null,432.9,{"$f":"N159+O159*W159+P159*W159*W159","v":79.929085854018922}]
["3000m",5014.5897000000004,-9.6100051999999998,4.6324319999999997E-3,0,"00:17:17.340","00:08:54.800",1200,null,null,null,null,"3000m",5014.5897000000004,-9.6100051999999998,4.6324319999999997E-3,0,"00:17:17.340","00:08:54.800",1200]
["60mH",4053.7330999999999,-446.17095999999998,12.278926999999999,24,17.899999999999999,8.2899999999999991,1198,null,null,null,null,"60mH",4053.7330999999999,-446.17095999999998,12.278926999999999,24,17.899999999999999,8.2899999999999991,1198]
["80mH",4136.5770000000002,-358.36138999999997,7.8180446999999997,24,22.93,10.69,1199,null,null,null,null,"80mH",4136.5770000000002,-358.36138999999997,7.8180446999999997,24,22.93,10.69,1199]
["300mH",4840.7156000000004,-122.03113999999999,0.77300732000000005,24,78.930000000000007,39.93,1200,null,null,null,null,"300mH",4840.7156000000004,-122.03113999999999,0.77300732000000005,24,78.930000000000007,39.93,1200]
["4x100m",4643.0511999999999,-101.43331000000001,0.55609774999999995,14,91.2,45.09,1200,null,null,null,null,"4x100m",4643.0511999999999,-101.43331000000001,0.55609774999999995,14,91.2,45.09,1200]
["højde",-969.72582999999997,776.37089000000003,194.04038,0,1.01,1.89,1190,null,null,null,null,"højde",-969.72582999999997,776.37089000000003,194.04038,0,1.01,1.89,1190]
["stang",-187.34621999999999,124.12542000000001,64.052745000000002,0,1.01,3.78,1197,null,null,null,null,"stang",-187.34621999999999,124.12542000000001,64.052745000000002,0,1.01,3.78,1197]
["længde",-615.49167999999997,206.25461999999999,11.365662,0,2.62,6.48,1198,null,null,null,null,"længde",-615.49167999999997,206.25461999999999,11.365662,0,2.62,6.48,1198]
["kugle",-595.22501,168.90319,-3.7964894,0,3.87,17.559999999999999,1200,null,null,null,null,"kugle",-595.22501,168.90319,-3.7964894,0,3.87,17.559999999999999,1200]
["diskos",-246.67088000000001,36.900302000000003,-0.19970906999999999,0,7,56.46,1200,null,null,null,null,"diskos",-246.67088000000001,36.900302000000003,-0.19970906999999999,0,7,56.46,1200]
["hammer",-227.07261,30.531590999999999,-9.1885781999999999E-2,0,7.65,56.27,1200,null,null,null,null,"hammer",-227.07261,30.531590999999999,-9.1885781999999999E-2,0,7.65,56.27,1200]
["spyd",-323,42.591000000000001,-0.30149999999999999,0,8.07,69.599999999999994,1180,null,null,null,null,"spyd",-323,42.591000000000001,-0.30149999999999999,0,8.07,69.599999999999994,1180]
[]
[]
["  DAF_P17:",null,null,null,null,null,null,null,null,null,null,null,"  DAF_P16:"]
["60m",5953.3854000000001,-906.86240999999995,34.610771,24,null,null,1200,null,null,null,null,"60m",5953.3854000000001,-906.86240999999995,34.610771,24,null,null,1200]
["100m",5702.0140000000001,-544.87431000000004,13.056018999999999,24,20.87,11.35,1199,null,null,null,null,"100m",5702.0140000000001,-544.87431000000004,13.056018999999999,24,20.87,11.35,1199]
["200m",4569.4967999999999,-196.70482000000001,2.1204752,24,46.38,22.66,1200,null,null,null,null,"200m",4569.4967999999999,-196.70482000000001,2.1204752,24,46.38,22.66,1200]
["400m",4848.2416999999996,-94.932785999999993,0.46677201000000001,14,101.69,51.44,1200,null,null,null,null,"400m",4848.2416999999996,-94.932785999999993,0.46677201000000001,14,101.69,51.44,1200]
["800m",5259.4402,-45.205190000000002,9.7714644000000003E-2,0,"00:03:51.310","00:02:01.930",1200,null,null,null,null,"800m",5259.4402,-45.205190000000002,9.7714644000000003E-2,0,"00:03:51.310","00:02:01.930",1200]
["1000m",5563.0989,-37.852451000000002,6.4750957999999997E-2,0,"00:04:52.290","00:02:37.930",1200,null,null,null,null,"1000m",5563.0989,-37.852451000000002,6.4750957999999997E-2,0,"00:04:52.290","00:02:37.930",1200]
["1500m",5110.7596999999996,-21.154765999999999,2.2024152000000002E-2,0,"00:08:00.260","00:04:09.840",1200,null,null,null,null,"1500m",5110.7596999999996,-21.154765999999999,2.2024152000000002E-2,0,"00:08:00.260","00:04:09.840",1200]
["3000m",5010.4323999999997,-9.5992111999999992,4.6259439999999999E-3,0,"00:17:17.520","00:08:54.750",1200,null,null,null,null,"3000m",5010.4323999999997,-9.5992111999999992,4.6259439999999999E-3,0,"00:17:17.520","00:08:54.750",1200]
["60mH",3842.6428999999998,-431.68727000000001,12.187830999999999,24,17.71,7.87,1200,null,null,null,null,"60mH",3842.6428999999998,-431.68727000000001,12.187830999999999,24,17.71,7.87,1200]
["100mH",3900.5634,-268.69731000000002,4.6536157999999999,24,28.87,12.96,1199,null,null,null,null,"100mH",3900.5634,-268.69731000000002,4.6536157999999999,24,28.87,12.96,1199]
["4x100m",4643.0511999999999,-101.43331000000001,0.55609774999999995,14,91.2,45.09,1200,null,null,null,null,"4x100m",4643.0511999999999,-101.43331000000001,0.55609774999999995,14,91.2,45.09,1200]
["højde",-967.07862,772.77113999999995,195.15521000000001,0,1.01,1.89,1190,null,null,null,null,"højde",-967.07862,772.77113999999995,195.15521000000001,0,1.01,1.89,1190]
["stang",-187.34621999999999,124.12542000000001,64.052745000000002,0,1.01,3.78,1197,null,null,null,null,"stang",-187.34621999999999,124.12542000000001,64.052745000000002,0,1.01,3.78,1197]
["længde",-623.51800000000003,211.63569000000001,10.719212000000001,0,2.61,6.48,1197,null,null,null,null,"længde",-623.51800000000003,211.63569000000001,10.719212000000001,0,2.61,6.48,1197]
["trespring",-789.56367999999998,111.99395,3.1853302999999999,0,6.03,12.98,1200,null,null,null,null,"trespring",-789.56367999999998,111.99395,3.1853302999999999,0,6.03,12.98,1200]
["kugle",-431.22987999999998,127.26043,-1.380315,0,3.54,15.39,1200,null,null,null,null,"kugle",-431.22987999999998,127.26043,-1.380315,0,3.54,15.39,1200]
["diskos",-254.6173,37.302650999999997,-0.20449597999999999,0,7.14,56.49,1200,null,null,null,null,"diskos",-254.6173,37.302650999999997,-0.20449597999999999,0,7.14,56.49,1200]
["hammer",-130.24690000000001,23.605172,3.6900851999999998E-2,0,5.52,52.11,1200,null,null,null,null,"hammer",-130.24690000000001,23.605172,3.6900851999999998E-2,0,5.52,52.11,1200]
["spyd",-304.58782000000002,38.139747999999997,-0.23242123000000001,0,8.4499999999999993,65.98,1200,null,null,null,null,"spyd",-304.58782000000002,38.139747999999997,-0.23242123000000001,0,8.4499999999999993,65.98,1200]
[]
[]
["  DAF_P19:",null,null,null,null,null,null,null,null,null,null,null,"  DAF_P18:"]
["60m",5953.3854000000001,-906.86240999999995,34.610771,24,null,null,1200,null,null,null,null,"60m",5953.3854000000001,-906.86240999999995,34.610771,24,null,null,1200]
["100m",5702.0140000000001,-544.87431000000004,13.056018999999999,24,20.87,11.35,1199,null,null,null,null,"100m",5702.0140000000001,-544.87431000000004,13.056018999999999,24,20.87,11.35,1199]
["200m",4569.4967999999999,-196.70482000000001,2.1204752,24,46.38,22.66,1200,null,null,null,null,"200m",4569.53,-196.70482000000001,2.1204572000000002,24,46.38,22.66,1200]
["400m",4848.2416999999996,-94.932785999999993,0.46677201000000001,14,101.69,51.44,1200,null,null,null,null,"400m",4848.2416999999996,-94.932785999999993,0.46677201000000001,14,101.69,51.44,1200]
["800m",5259.4402,-45.205190000000002,9.7714644000000003E-2,0,"00:03:51.310","00:02:01.930",1200,null,null,null,null,"800m",5259.4402,-45.205190000000002,9.7714644000000003E-2,0,"00:03:51.310","00:02:01.930",1200]
["1000m",5563.0989,-37.852451000000002,6.4750957999999997E-2,0,"00:04:52.290","00:02:37.930",1200,null,null,null,null,"1000m",5563.0989,-37.852451000000002,6.4750957999999997E-2,0,"00:04:52.290","00:02:37.930",1200]
["1500m",5110.7596999999996,-21.154765999999999,2.2024152000000002E-2,0,"00:08:00.260","00:04:09.840",1200,null,null,null,null,"1500m",5110.7596999999996,-21.154765999999999,2.2024152000000002E-2,0,"00:08:00.260","00:04:09.840",1200]
["3000m",5010.4323999999997,-9.5992111999999992,4.6259439999999999E-3,0,"00:17:17.520","00:08:54.750",1200,null,null,null,null,"3000m",5010.4323999999997,-9.5992111999999992,4.6259439999999999E-3,0,"00:17:17.520","00:08:54.750",1200]
["60mH",3842.6428999999998,-431.68727000000001,12.187830999999999,24,17.71,7.87,1200,null,null,null,null,"60mH",3842.6428999999998,-431.68727000000001,12.187830999999999,24,17.71,7.87,1200]
["100mH",3900.5634,-268.69731000000002,4.6536157999999999,24,28.87,12.96,1199,null,null,null,null,"100mH",3900.5634,-268.69731000000002,4.6536157999999999,24,28.87,12.96,1199]
["4x100m",4643.0511999999999,-101.43331000000001,0.55609774999999995,14,91.2,45.09,1200,null,null,null,null,"4x100m",4643.0511999999999,-101.43331000000001,0.55609774999999995,14,91.2,45.09,1200]
["højde",-967.07862,772.77113999999995,195.15521000000001,0,1.01,1.89,1190,null,null,null,null,"højde",-967.07862,772.77113999999995,195.15521000000001,0,1.01,1.89,1190]
["stang",-187.34621999999999,124.12542000000001,64.052745000000002,0,1.01,3.78,1197,null,null,null,null,"stang",-187.34621999999999,124.12542000000001,64.052745000000002,0,1.01,3.78,1197]
["længde",-623.51800000000003,211.63569000000001,10.719212000000001,0,2.61,6.48,1197,null,null,null,null,"længde",-623.51800000000003,211.63569000000001,10.719212000000001,0,2.61,6.48,1197]
["trespring",-789.56367999999998,111.99395,3.1853302999999999,0,6.03,12.98,1200,null,null,null,null,"trespring",-789.56367999999998,111.99395,3.1853302999999999,0,6.03,12.98,1200]
["kugle",-431.22987999999998,127.26043,-1.380315,0,3.54,15.39,1200,null,null,null,null,"kugle",-431.22987999999998,127.26043,-1.380315,0,3.54,15.39,1200]
["diskos",-254.6173,37.302650999999997,-0.20449597999999999,0,7.14,56.49,1200,null,null,null,null,"diskos",-254.6173,37.302650999999997,-0.20449597999999999,0,7.14,56.49,1200]
["hammer",-130.24690000000001,23.605172,3.6900851999999998E-2,0,5.52,52.11,1200,null,null,null,null,"hammer",-130.24690000000001,23.605172,3.6900851999999998E-2,0,5.52,52.11,1200]
["spyd",-304.58782000000002,38.139747999999997,-0.23242123000000001,0,8.4499999999999993,65.98,1200,null,null,null,null,"spyd",-304.58782000000002,38.139747999999997,-0.23242123000000001,0,8.4499999999999993,65.98,1200]
[]
[]
["Point = A + B * R + C * R * R",null,null,null,null,null,null,null,null,null,null,null,"Point = A + B * R + C * R * R"]
[]
["hvor R er resultat i enten sekunder eller meter",null,null,null,null,null,null,null,null,null,null,null,"hvor R er resultat i enten sekunder eller meter"]
[]
[]
["Fjerde kolonne er korrektion fra manuel tid til el-tid,",null,null,null,null,null,null,null,null,null,null,null,"Fjerde kolonne er korrektion fra manuel tid til el-tid,"]

{"sheet":"Print9_15","index":23,"n_rows":29,"n_cols":32,"rows_kept":29,"cut":false,"hidden":false,"merged":[[2,7,2,35],[16,31,16,34],[5,14,5,35],[7,14,7,35],[9,14,9,35],[11,14,11,35],[16,24,16,27],[16,28,16,29],[1,7,1,35],[3,7,3,35],[28,12,28,30],[20,9,20,18],[22,9,22,18],[18,9,18,18],[18,31,18,34],[20,31,20,34],[22,31,22,34],[18,24,18,27],[18,28,18,29],[20,24,20,27],[20,28,20,29],[22,24,22,27],[22,28,22,29],[16,9,16,18]]}
[]
[null,null,null,null,null,null,null,"Atletikmærket"]
[null,null,null,null,null,null,null,{"$f":"IF(Info!D28=0,\" \",Info!D28)","v":2013}]
[null,null,null,null,null,null,null,"tildelt"]
[]
[null,null,null,null,"Navn:",null,null,null,null,null,null,null,null,null,"Oliver R. Hvingel"]
[]
[null,null,null,null,"Klub:",null,null,null,null,null,null,null,null,null,"Vejle IF"]
[]
[null,null,null,null,"Pointsum:",null,null,null,null,null,null,null,null,null,2401]
[]
[null,null,null,null,"Mærke:",null,null,null,null,null,null,null,null,null,"Sølv"]
[]
[]
[null,null,null,null,"Øvelse",null,null,null,null,null,null,null,null,null,null,null,null,null,null,null,null,null,null,null,"Resultat"]
[]
[null,null,null,null,null,null,null,null,null,"40m",null,null,null,null,null,null,null,null,null,null,null,null,null,null,7.47,null,null,null,null,null,"/",919]
[]
[null,null,null,null,null,null,null,null,null,"længde",null,null,null,null,null,null,null,null,null,null,null,null,null,null,2.84,null,null,null,null,null,"/",547]
[]
[null,null,null,null,null,null,null,null,null,"kugle",null,null,null,null,null,null,null,null,null,null,null,null,null,null,3.85,null,null,null,null,null,"/",345]
[]
[null,null,null,null,null,null,null,null,null,"400m",null,null,null,null,null,null,null,null,null,null,null,null,null,null,93.81,null,null,null,null,null,"/",590]
[]
[]
[]
[null,null,null,null,null,null,null,null,null,null,null,null,null,null,null,null,null,null,null,null,null,null,null,null,null,"/"]
[]
[null,null,null,null,null,null,null,null,null,null,null,null,"Underskrift - dato"]

{"sheet":"Print16_19","index":24,"n_rows":31,"n_cols":27,"rows_kept":31,"cut":false,"hidden":false,"merged":[[20,26,20,30],[18,18,18,22],[18,23,18,24],[20,18,20,22],[20,23,20,24],[1,4,1,32],[3,4,3,32],[2,4,2,31],[30,13,30,25],[5,14,5,34],[7,14,7,34],[9,14,9,34],[11,14,11,34],[16,5,16,14],[16,26,16,30],[16,23,16,24],[16,18,16,22],[18,5,18,14],[18,26,18,30],[20,5,20,14]]}
[]
[null,null,null,null,"Atletikmærket"]
[null,null,null,null,{"$f":"IF(Info!D28=0,\" \",Info!D28)","v":2013}]
[null,null,null,null,"tildelt"]
[]
[null,null,null,"Navn:",null,null,null,null,null,null,null,null,null,null,"Victoria Holm Sørensen"]
[]
[null,null,null,"Klub:",null,null,null,null,null,null,null,null,null,null,"Vejle IF"]
[]
[null,null,null,"Pointsum:",null,null,null,null,null,null,null,null,null,null,1481]
[]
[null,null,null,"Mærke:",null,null,null,null,null,null,null,null,null,null,"Bronze"]
[]
[]
[null,null,null,"Øvelse",null,null,null,null,null,null,null,null,null,null,null,null,null,null,"Resultat"]
[]
[null,null,null,"1.",null,"kugle",null,null,null,null,null,null,null,null,null,null,null,null,9.3699999999999992,null,null,null,null,null,null,"/",640]
[]
[null,null,null,"2.",null,"100m",null,null,null,null,null,null,null,null,null,null,null,null,15.23,null,null,null,null,null,null,"/",431]
[]
[null,null,null,"3.",null,"diskos",null,null,null,null,null,null,null,null,null,null,null,null,20.03,null,null,null,null,null,null,"/",410]
[]
[]
[]
[]
[]
[]
[]
[null,null,null,null,null,null,null,null,null,null,null,null,null,null,null,null,null,null,null,"/"]
[]
[null,null,null,null,null,null,null,null,null,null,null,null,null,"Underskrift - dato"]

{"sheet":"Print16_19a","index":25,"n_rows":20,"n_cols":27,"rows_kept":20,"cut":false,"hidden":false,"merged":[[17,5,17,13],[19,5,19,13],[15,18,15,24],[15,26,15,30],[17,18,17,24],[17,26,17,30],[19,18,19,24],[19,26,19,30],[4,14,4,34],[6,14,6,34],[8,14,8,34],[10,14,10,34],[15,5,15,13]]}
[]
[]
[]
[]
[null,null,null,null,null,null,null,null,null,null,null,null,null,null,"Niels Hansen"]
[]
[null,null,null,null,null,null,null,null,null,null,null,null,null,null,"Greve IF"]
[]
[null,null,null,null,null,null,null,null,null,null,null,null,null,null,2300]
[]
[null,null,null,null,null,null,null,null,null,null,null,null,null,null,"Sølv"]
[]
[]
[]
[]
[null,null,null,null,null,"110mH",null,null,null,null,null,null,null,null,null,null,null,null,16,null,null,null,null,null,null,"/",828]
[]
[null,null,null,null,null,"længde",null,null,null,null,null,null,null,null,null,null,null,null,6,null,null,null,null,null,null,"/",759]
[]
[null,null,null,null,null,"400m",null,null,null,null,null,null,null,null,null,null,null,null,"00:00:56",null,null,null,null,null,null,"/",713]

{"sheet":"Print9_15 Diplom","index":26,"n_rows":22,"n_cols":32,"rows_kept":22,"cut":false,"hidden":false,"merged":[[21,9,21,18],[21,24,21,27],[21,28,21,29],[21,31,21,34],[17,9,17,18],[17,24,17,27],[17,28,17,29],[17,31,17,34],[19,9,19,18],[19,24,19,27],[19,28,19,29],[19,31,19,34],[4,14,4,35],[6,14,6,35],[8,14,8,35],[10,14,10,35],[15,9,15,18],[15,24,15,27],[15,28,15,29],[15,31,15,34]]}
[]
[]
[]
[]
[null,null,null,null,null,null,null,null,null,null,null,null,null,null,"Oliver R. Hvingel"]
[]
[null,null,null,null,null,null,null,null,null,null,null,null,null,null,"Vejle IF"]
[]
[null,null,null,null,null,null,null,null,null,null,null,null,null,null,2401]
[]
[null,null,null,null,null,null,null,null,null,null,null,null,null,null,"Sølv"]
[]
[]
[]
[]
[null,null,null,null,null,null,null,null,null,"40m",null,null,null,null,null,null,null,null,null,null,null,null,null,null,7.47,null,null,null,null,null,"/",919]
[]
[null,null,null,null,null,null,null,null,null,"længde",null,null,null,null,null,null,null,null,null,null,null,null,null,null,2.84,null,null,null,null,null,"/",547]
[]
[null,null,null,null,null,null,null,null,null,"kugle",null,null,null,null,null,null,null,null,null,null,null,null,null,null,3.85,null,null,null,null,null,"/",345]
[]
[null,null,null,null,null,null,null,null,null,"400m",null,null,null,null,null,null,null,null,null,null,null,null,null,null,93.81,null,null,null,null,null,"/",590]

{"sheet":"Print16_19 Diplom","index":27,"n_rows":20,"n_cols":27,"rows_kept":20,"cut":false,"hidden":false,"merged":[[17,5,17,14],[17,18,17,22],[17,23,17,24],[17,26,17,30],[19,5,19,14],[19,18,19,22],[19,23,19,24],[19,26,19,30],[4,14,4,34],[6,14,6,34],[8,14,8,34],[10,14,10,34],[15,5,15,14],[15,18,15,22],[15,23,15,24],[15,26,15,30]]}
[]
[]
[]
[]
[null,null,null,null,null,null,null,null,null,null,null,null,null,null,"Victoria Holm Sørensen"]
[]
[null,null,null,null,null,null,null,null,null,null,null,null,null,null,"Vejle IF"]
[]
[null,null,null,null,null,null,null,null,null,null,null,null,null,null,1481]
[]
[null,null,null,null,null,null,null,null,null,null,null,null,null,null,"Bronze"]
[]
[]
[]
[]
[null,null,null,null,null,"kugle",null,null,null,null,null,null,null,null,null,null,null,null,9.3699999999999992,null,null,null,null,null,null,"/",640]
[]
[null,null,null,null,null,"100m",null,null,null,null,null,null,null,null,null,null,null,null,15.23,null,null,null,null,null,null,"/",431]
[]
[null,null,null,null,null,"diskos",null,null,null,null,null,null,null,null,null,null,null,null,20.03,null,null,null,null,null,null,"/",410]

{"sheet":"Info","index":28,"n_rows":29,"n_cols":7,"rows_kept":29,"cut":false,"hidden":false,"merged":[[28,3,28,4],[27,3,27,4],[27,6,28,6]]}
[]
[null,null,null,"Information i brug af denne fil:"]
[null,null,null,"Knapperne til venstre vælger køn- og aldersgruppe."]
[null,null,null,"I det aktuelle skema indtastes bedste resultat for pågældende atlet i diverse discipliner."]
[null,null,null,"Programmet beregner selv pointene og skriver pointene i feltet ved siden af resultatet."]
[null,null,null,"Programmet regner pointene sammen for 9-15 år: 1 løb, 1 spring, 1 kast og 4. disciplin."]
[null,null,null,"Programmet regner pointene sammen for 16-19 år: 3 bedste discipliner."]
[null,null,null,"Programmet fremhæver de point, der er gældende for det samlede resultat."]
[null,null,null,"Programmet tildeler valør på atletikmærke (Guld, Sølv, Bronze)."]
[null,null,null,"Ved løb anvendes 2 forskellige tidsformater."]
[null,null,null,"De korte løb er opgivet i sek., tiendedele og hundrededele. (feks. 45,81)"]
[null,null,null,"De længere løb er opgivet i min., sek., tiendedele og hundreddele. (feks. 02:13,49)"]
[null,null,null,"Skriv 0 og Enter i resultatfeltet og bliv klogere."]
[null,null,null,"Ved hjælp af M-knappen kan vælges [Man] for mauel tidtagning, herved indregnes hhv. 0,24 eller 0,14 sek. tillæg."]
[]
[null,null,null,"Print af Diplom:"]
[null,null,null,"Årstal og Klubnavn indtastes nederst på Info-siden (kopieres automatisk til alle andre sider)."]
[null,null,null,"Vælg via \"Print type\", om der skal printes data på diplom eller om der skal printes et diplom på hvidt ark."]
[null,null,null,"Indtast atletens navn på aktuel side."]
[null,null,null,"Læg diplom eller hvidt ark i printeren og tryk på \"Print\"-knappen."]
[]
[null,null,null,"Jeg håber at dette værktøj hjælper jer med arbejdet omkring Atletikmærket."]
[null,null,null,"MVH"]
[null,null,null,"Carsten Rytter"]
[]
[]
[]
[null,null,"Årstal:",2013,null,null,"På   diplom"]
[null,null,"Klub:","Vejle IF"]